{"text_format":"1","workbook":"xlsx","n_sheets":42,"sheets":["Titelblatt","INHALTSVERZEICHNIS","Projektgrunddaten","Flächennutzungen","Bevölkerung, Beschäftige","Schadensrel. Merkmale WGebäude","Schadensermittlung Wohngebäude","Schadensrel. MM NichtWGebäude","Schadensermittl.  NichtWGebäude","Schadenseingabe Öffentl. Geb.","Wertschöpfungsverluste","Infrastruktur","Wasserbauliche Anlagen","Land-, Forstwirtschaft","Sonstige Flächennutzungen","Fremdenverkehr","Summe monetär bewertete Schäden","Schadenserwartungen","A1 Kostenermittlung","A1 monetäre  ökonom Effizienz","A1 Weitere Projektwirkungen","A1 Zssfg Teilbilanzen","A2 Kostenermittlung","A2 monetäre  ökonom Effizienz","A2 Weitere Projektwirkungen","A2 Zssfg Teilbilanzen","A3 Kostenermittlung","A3 monetäre  ökonom Effizienz","A3 Weitere Projektwirkungen","A3 Zssfg Teilbilanzen","A4 Kostenermittlung","A4 monetäre  ökonom Effizienz","A4 Weitere Projektwirkungen","A4 Zssfg Teilbilanzen","Alternativenvergleich","Einordnung in integrales HWSM","Detailliste Wirtschaftszweige","Daten für Bruttowertschöpfung","Faktoren","Berechnungsgrundlagen","Wertanpassung","test"],"not_rendered":{"charts":2,"images":147,"macros":1,"external_links":0,"defined_names":67,"comments":4,"pivot_tables":0},"unopened":[],"bounds":{"document_bytes":16777216,"sheet_cells":100000,"rows_first":2000,"rows_last":500,"rows_between":2000,"halvings":0,"cell_chars":16384,"cell_head_chars":4096},"cells_cut":0,"cells_raw":0,"read":"whole","date_system":"1900"}

{"sheet":"Titelblatt","index":0,"n_rows":28,"n_cols":3,"rows_kept":28,"cut":false,"hidden":false,"merged":[[28,0,28,2],[9,0,9,2],[0,0,0,2],[1,0,1,2],[2,0,2,2],[4,0,4,2],[7,0,7,2],[11,0,11,2],[14,0,14,2],[15,0,15,2],[16,0,16,2]]}
[]
["Kosten-Nutzen-Untersuchung"]
["im Schutzwasserbau"]
[]
["Version 2015 Juni"]
[]
[]
["gem. § 3 Abs 2 Zi 3 WbfG 1985 idgF"]
[]
["Berechnungen für die Kosten-Nutzen-Untersuchung \nvon wasserbaulichen Projekten gemäß RIWA - T"]
[]
["gültig für\nGewässerentwicklungskonzepte, Generelle Projekte, Detailprojekte"]
[]
["Projektstitel"]
["Titel 1"]
["Titel 2 Zeile 1"]
["Titel 2 Zeile 2"]
["Projektsnummer",null,"Verfasser"]
[]
["Ausfertigung",null,"Datum"]
[]
[]
[]
["Auftragnehmer",null,"Auftraggeber"]
["Auftragnehmer 1",null,"Auftraggeber 1"]
["Auftragnehmer 2",null,"Auftraggeber 2"]
["Auftragnehmer 3",null,"Auftraggeber 3"]
[null,null,{"$f":"MID(CELL(\"Dateiname\",C28),FIND(\"[\",CELL(\"Dateiname\",C28))+1,FIND(\"]\",CELL(\"Dateiname\",C28))-FIND(\"[\",CELL(\"Dateiname\",C28))-1)","v":"KNU-Berechnungsvorlage_juni_2015_krm.xlsm"}]

{"sheet":"INHALTSVERZEICHNIS","index":1,"n_rows":37,"n_cols":6,"rows_kept":37,"cut":false,"hidden":false,"merged":[[0,0,0,5],[1,1,1,4],[28,0,28,5],[36,0,36,5]]}
["INHALSVERZEICHNIS ZU DEN FORMBLÄTTERN"]
["Thema","Alternativen"]
["GRUNDLAGEN"]
["Projektgrunddaten"]
["Flächennutzungen"]
["Bevölkerungs- und Beschäftigtenzahlen"]
["SCHADENSANALYSEN"]
["Schadensrelevante Merkmale Wohngebäude"]
["Schadensermittlung Wohngebäude"]
["Schadensrelevante Merkmale Nicht - Wohngebäude"]
["Schadensermittlung und -eingabe Nicht - Wohngebäude"]
["Schadenseingabe Öffentliche Gebäude"]
["Wertschöpfungsverluste"]
["Verkehrs-, Ver- und Entsorgungsinfrastruktur"]
["Wasserbauliche Anlagen und Gewässer"]
["Land- und forstwirtschaftliche Flächen"]
["Sonstige Flächennutzungen"]
["Fremdenverkehr"]
["Summe monetär bewertete Schäden"]
["AUSWERTUNGEN"]
["Schadenserwartungen"]
["Kostenermittlung","A2","A3","A4"]
["monetär belegte ökonomische Effizienz","A2","A3","A4"]
["Darstellung und Beurteilung der weiteren Projektwirkungen","A2","A3","A4"]
["Zusammenfassung der Teilbilanzen einer Alternative","A2","A3","A4"]
["Alternativenvergleich"]
["Einordnung in das integrale Hochwasserschutzmanagement"]
[]
["LEGENDE"]
[]
["Eingabefeld, Eingabe durch SachbearbeiterIn erforderlich",null,null,null,null,"Eingabefeld"]
[]
["Feld mit Pull-Down Menü, Auswahl wird durch Bearbeiter getroffen",null,null,null,null,"Auswahl A"]
[]
["Text- oder Berechnungsfelder, keine Eingaben erlaubt",null,null,null,null,"Ergebnis"]
[]
["Sämtliche Angaben zu Kosten und Nutzen in den folgenden Formblättern sind in Nettogrößen anzugeben!"]

{"sheet":"Projektgrunddaten","index":2,"n_rows":34,"n_cols":6,"rows_kept":34,"cut":false,"hidden":false,"merged":[[38,4,38,5],[39,4,39,5],[21,0,21,1],[33,4,33,5],[35,4,35,5],[36,4,36,5],[37,4,37,5],[34,4,34,5],[14,2,15,2],[14,3,14,5],[16,2,17,2],[16,3,16,5],[18,2,19,2],[18,3,18,5],[8,0,8,1],[8,2,8,5],[9,0,9,5],[10,0,10,1],[12,0,12,1],[12,2,13,2],[12,3,12,5],[4,0,4,1],[4,2,4,5],[5,0,5,1],[5,2,5,5],[6,0,6,1],[6,2,6,5],[0,0,0,5],[1,0,1,1],[2,0,2,1],[2,2,2,5],[3,0,3,1],[3,2,3,5]]}
["PROJEKTGRUNDDATEN"]
["Projektkenndaten"]
["Projektbezeichnung"]
["Gewässereinzugsgebiet"]
["Gewässer"]
["Gemeinde(n), Bezirk"]
["Bundesland",null,"Österreich"]
[]
["Projekttyp",null,"Detailprojekt"]
[]
["Alternativen"]
[null,"Anzahl"]
["Bezeichnung",null,{"$f":"+Berechnungsgrundlagen!E22","v":"A1"},"Name Alternative 1"]
[null,null,null,null,"Maßnahme","Linearmaßnahmen"]
[null,null,{"$f":"+Berechnungsgrundlagen!E23","v":"A2"},"Name Alternative 2"]
[null,null,null,null,"Maßnahme","Linearmaßnahmen"]
[null,null,{"$f":"+Berechnungsgrundlagen!E24","v":"A3"},"Name Alternative 3"]
[null,null,null,null,"Maßnahme","Retentions- oder Kombimaßnahmen"]
[null,null,{"$f":"+Berechnungsgrundlagen!E25","v":"A4"},"Name Alternative 4"]
[null,null,null,null,"Maßnahme","Linearmaßnahmen"]
[]
["Ausuferungsbeginn, Bemessungshochwasser\nund HQ - Stützstellen",null,"Jährlichkeit (HQ)","Durchfluss (m³/s)","BHQ","Wählen Sie hier die Anzahl der maßgeblichen HQ-Stützstellen (siehe Erläuterungen!). Definieren Sie die Jährlichkeiten der Stützstellen, des Ausuferungsbeginns und ein Bemessungshochwasser (BHQ). Die Übernahme der Jährlichkeiten in die weiteren Arbeitsblätter erfolgt automatisch."]
[null,"Anzahl",null,null,null,"Ausuferungsbeginn"]
[null,1,null,null,null,"Stützstelle"]
[null,2,null,null,null,"Stützstelle"]
[null,3,null,null,null,"Stützstelle"]
[null,4,null,null,null,"Stützstelle"]
[null,5,null,null,null,"Stützstelle"]
[null,6,100,null,null,"Bemessungshochwasser"]
[null,7,null,null,null,"Stützstelle"]
[]
[]
["Bisherige schadbringende Ereignisse"]
["Jahr","max. Durchfluss\nin m³","Jährlichkeit\nHQ","Schadenssumme\nin €"," Schadensbeschreibung in Stichworten"]

{"sheet":"Flächennutzungen","index":3,"n_rows":60,"n_cols":16,"rows_kept":60,"cut":false,"hidden":false,"merged":[[57,14,57,15],[59,0,59,1],[44,14,44,15],[45,0,45,1],[46,0,53,0],[54,0,54,1],[57,2,57,3],[57,4,57,5],[57,6,57,7],[57,8,57,9],[57,10,57,11],[57,12,57,13],[35,14,35,15],[36,0,36,1],[37,0,41,0],[42,0,42,1],[44,2,44,3],[44,4,44,5],[44,6,44,7],[44,8,44,9],[44,10,44,11],[44,12,44,13],[22,14,22,15],[23,0,23,1],[24,0,32,0],[33,0,33,1],[35,2,35,3],[35,4,35,5],[35,6,35,7],[35,8,35,9],[35,10,35,11],[35,12,35,13],[22,2,22,3],[22,4,22,5],[22,6,22,7],[22,8,22,9],[22,10,22,11],[22,12,22,13],[20,0,20,1],[0,0,0,15],[2,2,2,3],[2,4,2,5],[2,6,2,7],[2,8,2,9],[2,10,2,11],[2,12,2,13],[2,14,2,15],[3,0,3,1],[4,0,6,0],[7,0,17,0],[18,0,18,1],[19,0,19,1]]}
["FLÄCHENNUTZUNGEN"]
[]
[null,"bei HQ",{"$f":"Projektgrunddaten!$C$24","v":0},null,{"$f":"Projektgrunddaten!$C$25","v":0},null,{"$f":"Projektgrunddaten!$C$26","v":0},null,{"$f":"Projektgrunddaten!$C$27","v":0},null,{"$f":"Projektgrunddaten!$C$28","v":0},null,{"$f":"Projektgrunddaten!$C$29","v":100},null,{"$f":"Projektgrunddaten!$C$30","v":0}]
["Flächennutzung bebaute Grundstücke (Wohn- u. Nicht-Wohngebäude)",null,"Anzahl","Bauland-\nfläche gesamt, m²","Anzahl","Bauland-\nfläche gesamt, m²","Anzahl","Bauland-\nfläche gesamt, m²","Anzahl","Bauland-\nfläche gesamt, m²","Anzahl","Bauland-\nfläche gesamt, m²","Anzahl","Bauland-\nfläche gesamt, m²","Anzahl","Bauland-\nfläche gesamt, m²"]
["Wohngebäude","Gebäude mit einer Wohnung (Einfamilienhaus, Reihenhaus)"]
[null,"Gebäude mit zwei oder mehr Wohnungen\n"]
[null,"Wohngebäude für Gemeinschaften (Senioren-, Schüler-, Studentenheime, Schwesterntrakt)"]
["Nicht-Wohngebäude","Hotels,andere Beherbungsbetriebe"]
[null,"Bürogebäude"]
[null,"Groß- und Einzelhandelsgebäude"]
[null,"Gebäude des Verkehrs- und Nachrichtenwesens"]
[null,"Industrie- und Lagergebäude"]
[null,"Gebäude für Kultur- und Freizeitzwecke"]
[null,"Gebäude des Bildungs- und Gesundheitswesens"]
[null,"Sonstige Baulichkeiten (Landwirtschaftliche Nutzgebäude, Kirchen, freistehende Privatgaragen, sonstige und Pseudobaulichkeiten)"]
[null,"Wirtschafts- und Nebengebäude"]
[null,"Versorgungsobjekte (Kläranlagen, Brunnen, Trafostationen etc.)"]
[null,"Hier nicht angeführte Nicht-Wohngebäude"]
["Zwischensumme Anzahl, Flächen Wohngebäude",null,{"$f":"SUM(C5:C7)","v":0},0,0,0,0,0,0,0,0,0,0,0,0,0]
["Zwischensumme Anzahl, Flächen Nicht-Wohngebäude",null,{"$f":"SUM(C8:C18)","v":0},{"$f":"SUM(D8:D18)","v":0},{"$f":"SUM(E8:E18)","v":0},0,0,0,0,0,0,0,0,0,0,0]
["Summe Anzahl, Fläche bebaute Grundstücke (Wohn- u. Nicht-Wohngebäude)",null,{"$f":"SUM(C19:C20)","v":0},0,0,0,0,0,0,0,0,0,0,0,0,0]
[]
[null,"bei HQ",{"$f":"Projektgrunddaten!$C$24","v":0},null,{"$f":"Projektgrunddaten!$C$25","v":0},null,{"$f":"Projektgrunddaten!$C$26","v":0},null,{"$f":"Projektgrunddaten!$C$27","v":0},null,{"$f":"Projektgrunddaten!$C$28","v":0},null,{"$f":"Projektgrunddaten!$C$29","v":100},null,{"$f":"Projektgrunddaten!$C$30","v":0}]
["Flächennutzung Verkehrsinfrastruktur",null,null,"Fläche in m²",null,"Fläche in m²",null,"Fläche in m²",null,"Fläche in m²",null,"Fläche in m²",null,"Fläche in m²",null,"Fläche in m²"]
["Verkehrsinfrastruktur","Autobahn, Schnellstraße (4- und mehrspurig, baulich getrennt)"]
[null,"Landeshauptstraße (4-spurig)"]
[null,"Landesstraße (2-spurig)"]
[null,"Gemeindestraßen (2-spurig)"]
[null,"Sonstige Wege"]
[null,"Bahn 1-gleisig"]
[null,"Bahn 2-gleisig"]
[null,"Flugbetriebsflächen"]
[null,"Schifffahrtseinrichtungen"]
["Summe Verkehrsinfrastruktur [m²]",null,null,{"$f":"SUM(D25:D33)","v":0},null,{"$f":"SUM(F25:F33)","v":0},null,{"$f":"SUM(H25:H33)","v":0},null,{"$f":"SUM(J25:J33)","v":0},null,{"$f":"SUM(L25:L33)","v":0},null,{"$f":"SUM(N25:N33)","v":0},null,{"$f":"SUM(P25:P33)","v":0}]
[]
[null,"bei HQ",{"$f":"Projektgrunddaten!$C$24","v":0},null,{"$f":"Projektgrunddaten!$C$25","v":0},null,{"$f":"Projektgrunddaten!$C$26","v":0},null,{"$f":"Projektgrunddaten!$C$27","v":0},null,{"$f":"Projektgrunddaten!$C$28","v":0},null,{"$f":"Projektgrunddaten!$C$29","v":100},null,{"$f":"Projektgrunddaten!$C$30","v":0}]
["Land- und forstwirtschaftliche Flächen",null,null,"Fläche in m²",null,"Fläche in m²",null,"Fläche in m²",null,"Fläche in m²",null,"Fläche in m²",null,"Fläche in m²",null,"Fläche in m²"]
["Land- und forstw. Fl.","Grünland"]
[null,"Ackerland"]
[null,"Sonderkulturen"]
[null,"Sonstige Nutzflächen (z.B. Fischteichanlagen)"]
[null,"Forstwirtschaftliche Flächen"]
["Summe Land- Forstwirtschaftliche Flächen [m²]",null,null,{"$f":"SUM(D38:D42)","v":0},null,{"$f":"SUM(F38:F42)","v":0},null,{"$f":"SUM(H38:H42)","v":0},null,{"$f":"SUM(J38:J42)","v":0},null,{"$f":"SUM(L38:L42)","v":0},null,{"$f":"SUM(N38:N42)","v":0},null,{"$f":"SUM(P38:P42)","v":0}]
[]
[null,"bei HQ",{"$f":"Projektgrunddaten!$C$24","v":0},null,{"$f":"Projektgrunddaten!$C$25","v":0},null,{"$f":"Projektgrunddaten!$C$26","v":0},null,{"$f":"Projektgrunddaten!$C$27","v":0},null,{"$f":"Projektgrunddaten!$C$28","v":0},null,{"$f":"Projektgrunddaten!$C$29","v":100},null,{"$f":"Projektgrunddaten!$C$30","v":0}]
["Sonstige Flächennutzungen",null,null,"Fläche in m²",null,"Fläche in m²",null,"Fläche in m²",null,"Fläche in m²",null,"Fläche in m²",null,"Fläche in m²",null,"Fläche in m²"]
["Sonstige \nFlächen","Grünflächen"]
[null,"Sport- und Freizeitflächen, Kinderspielplätze"]
[null,"Campingplätze"]
[null,"Parkanlagen"]
[null,"Friedhöfe"]
[null,"Kleingartensiedlungen"]
[null,"Sonstige Flächennutzungen 1"]
[null,"Sonstige Flächennutzungen 2"]
["Summe Sonstige Flächennutzungen  [m²]",null,null,{"$f":"SUM(D47:D54)","v":0},null,{"$f":"SUM(F47:F54)","v":0},null,{"$f":"SUM(H47:H54)","v":0},null,{"$f":"SUM(J47:J54)","v":0},null,{"$f":"SUM(L47:L54)","v":0},null,{"$f":"SUM(N47:N54)","v":0},null,{"$f":"SUM(P47:P54)","v":0}]
[]
[]
["Gesamtsumme betroffene Flächen bei HQx [m²]",null,{"$f":"Projektgrunddaten!$C$24","v":0},null,{"$f":"Projektgrunddaten!$C$25","v":0},null,{"$f":"Projektgrunddaten!$C$26","v":0},null,{"$f":"Projektgrunddaten!$C$27","v":0},null,{"$f":"Projektgrunddaten!$C$28","v":0},null,{"$f":"Projektgrunddaten!$C$29","v":100},null,{"$f":"Projektgrunddaten!$C$30","v":0}]
[null,null,null,"Fläche in m²",null,"Fläche in m²",null,"Fläche in m²",null,"Fläche in m²",null,"Fläche in m²",null,"Fläche in m²",null,"Fläche in m²"]
[null,null,null,{"$f":"D21+D34+D43+D55","v":0},null,{"$f":"F21+F34+F43+F55","v":0},null,{"$f":"H21+H34+H43+H55","v":0},null,{"$f":"J21+J34+J43+J55","v":0},null,{"$f":"L21+L34+L43+L55","v":0},null,{"$f":"N21+N34+N43+N55","v":0},null,{"$f":"P21+P34+P43+P55","v":0}]

{"sheet":"Bevölkerung, Beschäftige","index":4,"n_rows":25,"n_cols":9,"rows_kept":25,"cut":false,"hidden":false,"merged":[[25,0,25,8],[26,0,26,8],[0,0,0,8],[1,0,1,1],[2,2,2,8],[4,0,6,0],[8,0,21,0],[24,0,24,8]]}
["BEVÖLKERUNGS- UND BESCHÄFTIGTENZAHLEN"]
[]
[null,null,"Anzahl Betroffene"]
[null,"bei HQ",{"$f":"Projektgrunddaten!$C$24","v":0},{"$f":"Projektgrunddaten!$C$25","v":0},{"$f":"Projektgrunddaten!$C$26","v":0},{"$f":"Projektgrunddaten!$C$27","v":0},{"$f":"Projektgrunddaten!$C$28","v":0},{"$f":"Projektgrunddaten!$C$29","v":100},{"$f":"Projektgrunddaten!$C$30","v":0}]
["Bevölkerungs\n-zahlen","Direkt Betroffene"]
[null," Indirekt Betroffene (siehe Erläuterungen)"]
[null,"Summe direkt/indirekt betroffene Bevölkerung",{"$f":"SUM(C5:C6)","v":0},0,0,0,0,0,0]
[]
["Beschäftigtenzahlen",{"$f":"'Daten für Bruttowertschöpfung'!B2","v":"Bergbau und Gewinnung von Steinen u. Erden (B)"},{"$f":"SUMIF('Schadensermittl.  NichtWGebäude'!$B$7:$B$8,'Daten für Bruttowertschöpfung'!$B2,'Schadensermittl.  NichtWGebäude'!$Q$7:$Q$8)","v":0},{"$f":"SUMIF('Schadensermittl.  NichtWGebäude'!$B$7:$B$8,'Daten für Bruttowertschöpfung'!$B2,'Schadensermittl.  NichtWGebäude'!$AG$7:$AG$8)","v":0},{"$f":"SUMIF('Schadensermittl.  NichtWGebäude'!$B$7:$B$8,'Daten für Bruttowertschöpfung'!$B2,'Schadensermittl.  NichtWGebäude'!$AW$7:$AW$8)","v":0},{"$f":"SUMIF('Schadensermittl.  NichtWGebäude'!$B$7:$B$8,'Daten für Bruttowertschöpfung'!$B2,'Schadensermittl.  NichtWGebäude'!$BM$7:$BM$8)","v":0},{"$f":"SUMIF('Schadensermittl.  NichtWGebäude'!$B$7:$B$8,'Daten für Bruttowertschöpfung'!$B2,'Schadensermittl.  NichtWGebäude'!$CC$7:$CC$8)","v":0},{"$f":"SUMIF('Schadensermittl.  NichtWGebäude'!$B$7:$B$8,'Daten für Bruttowertschöpfung'!$B2,'Schadensermittl.  NichtWGebäude'!$CS$7:$CS$8)","v":0},{"$f":"SUMIF('Schadensermittl.  NichtWGebäude'!$B$7:$B$8,'Daten für Bruttowertschöpfung'!$B2,'Schadensermittl.  NichtWGebäude'!$DI$7:$DI$8)","v":0}]
[null,{"$f":"'Daten für Bruttowertschöpfung'!B3","v":"Herstellung von Waren  (C)"},{"$f":"SUMIF('Schadensermittl.  NichtWGebäude'!$B$7:$B$8,'Daten für Bruttowertschöpfung'!$B3,'Schadensermittl.  NichtWGebäude'!$Q$7:$Q$8)","v":0},{"$f":"SUMIF('Schadensermittl.  NichtWGebäude'!$B$7:$B$8,'Daten für Bruttowertschöpfung'!$B3,'Schadensermittl.  NichtWGebäude'!$AG$7:$AG$8)","v":0},{"$f":"SUMIF('Schadensermittl.  NichtWGebäude'!$B$7:$B$8,'Daten für Bruttowertschöpfung'!$B3,'Schadensermittl.  NichtWGebäude'!$AW$7:$AW$8)","v":0},{"$f":"SUMIF('Schadensermittl.  NichtWGebäude'!$B$7:$B$8,'Daten für Bruttowertschöpfung'!$B3,'Schadensermittl.  NichtWGebäude'!$BM$7:$BM$8)","v":0},{"$f":"SUMIF('Schadensermittl.  NichtWGebäude'!$B$7:$B$8,'Daten für Bruttowertschöpfung'!$B3,'Schadensermittl.  NichtWGebäude'!$CC$7:$CC$8)","v":0},{"$f":"SUMIF('Schadensermittl.  NichtWGebäude'!$B$7:$B$8,'Daten für Bruttowertschöpfung'!$B3,'Schadensermittl.  NichtWGebäude'!$CS$7:$CS$8)","v":0},{"$f":"SUMIF('Schadensermittl.  NichtWGebäude'!$B$7:$B$8,'Daten für Bruttowertschöpfung'!$B3,'Schadensermittl.  NichtWGebäude'!$DI$7:$DI$8)","v":0}]
[null,{"$f":"'Daten für Bruttowertschöpfung'!B4","v":"Energieversorgung (D)"},{"$f":"SUMIF('Schadensermittl.  NichtWGebäude'!$B$7:$B$8,'Daten für Bruttowertschöpfung'!$B4,'Schadensermittl.  NichtWGebäude'!$Q$7:$Q$8)","v":0},{"$f":"SUMIF('Schadensermittl.  NichtWGebäude'!$B$7:$B$8,'Daten für Bruttowertschöpfung'!$B4,'Schadensermittl.  NichtWGebäude'!$AG$7:$AG$8)","v":0},{"$f":"SUMIF('Schadensermittl.  NichtWGebäude'!$B$7:$B$8,'Daten für Bruttowertschöpfung'!$B4,'Schadensermittl.  NichtWGebäude'!$AW$7:$AW$8)","v":0},{"$f":"SUMIF('Schadensermittl.  NichtWGebäude'!$B$7:$B$8,'Daten für Bruttowertschöpfung'!$B4,'Schadensermittl.  NichtWGebäude'!$BM$7:$BM$8)","v":0},{"$f":"SUMIF('Schadensermittl.  NichtWGebäude'!$B$7:$B$8,'Daten für Bruttowertschöpfung'!$B4,'Schadensermittl.  NichtWGebäude'!$CC$7:$CC$8)","v":0},{"$f":"SUMIF('Schadensermittl.  NichtWGebäude'!$B$7:$B$8,'Daten für Bruttowertschöpfung'!$B4,'Schadensermittl.  NichtWGebäude'!$CS$7:$CS$8)","v":0},{"$f":"SUMIF('Schadensermittl.  NichtWGebäude'!$B$7:$B$8,'Daten für Bruttowertschöpfung'!$B4,'Schadensermittl.  NichtWGebäude'!$DI$7:$DI$8)","v":0}]
[null,{"$f":"'Daten für Bruttowertschöpfung'!B5","v":"Wasserversorgung; Abwasser- u. Abfallentsorgung u. Beseitigung v. Umweltverschmutzungen (E)"},{"$f":"SUMIF('Schadensermittl.  NichtWGebäude'!$B$7:$B$8,'Daten für Bruttowertschöpfung'!$B5,'Schadensermittl.  NichtWGebäude'!$Q$7:$Q$8)","v":0},{"$f":"SUMIF('Schadensermittl.  NichtWGebäude'!$B$7:$B$8,'Daten für Bruttowertschöpfung'!$B5,'Schadensermittl.  NichtWGebäude'!$AG$7:$AG$8)","v":0},{"$f":"SUMIF('Schadensermittl.  NichtWGebäude'!$B$7:$B$8,'Daten für Bruttowertschöpfung'!$B5,'Schadensermittl.  NichtWGebäude'!$AW$7:$AW$8)","v":0},{"$f":"SUMIF('Schadensermittl.  NichtWGebäude'!$B$7:$B$8,'Daten für Bruttowertschöpfung'!$B5,'Schadensermittl.  NichtWGebäude'!$BM$7:$BM$8)","v":0},{"$f":"SUMIF('Schadensermittl.  NichtWGebäude'!$B$7:$B$8,'Daten für Bruttowertschöpfung'!$B5,'Schadensermittl.  NichtWGebäude'!$CC$7:$CC$8)","v":0},{"$f":"SUMIF('Schadensermittl.  NichtWGebäude'!$B$7:$B$8,'Daten für Bruttowertschöpfung'!$B5,'Schadensermittl.  NichtWGebäude'!$CS$7:$CS$8)","v":0},{"$f":"SUMIF('Schadensermittl.  NichtWGebäude'!$B$7:$B$8,'Daten für Bruttowertschöpfung'!$B5,'Schadensermittl.  NichtWGebäude'!$DI$7:$DI$8)","v":0}]
[null,{"$f":"'Daten für Bruttowertschöpfung'!B6","v":"Bau (F)"},{"$f":"SUMIF('Schadensermittl.  NichtWGebäude'!$B$7:$B$8,'Daten für Bruttowertschöpfung'!$B6,'Schadensermittl.  NichtWGebäude'!$Q$7:$Q$8)","v":0},{"$f":"SUMIF('Schadensermittl.  NichtWGebäude'!$B$7:$B$8,'Daten für Bruttowertschöpfung'!$B6,'Schadensermittl.  NichtWGebäude'!$AG$7:$AG$8)","v":0},{"$f":"SUMIF('Schadensermittl.  NichtWGebäude'!$B$7:$B$8,'Daten für Bruttowertschöpfung'!$B6,'Schadensermittl.  NichtWGebäude'!$AW$7:$AW$8)","v":0},{"$f":"SUMIF('Schadensermittl.  NichtWGebäude'!$B$7:$B$8,'Daten für Bruttowertschöpfung'!$B6,'Schadensermittl.  NichtWGebäude'!$BM$7:$BM$8)","v":0},{"$f":"SUMIF('Schadensermittl.  NichtWGebäude'!$B$7:$B$8,'Daten für Bruttowertschöpfung'!$B6,'Schadensermittl.  NichtWGebäude'!$CC$7:$CC$8)","v":0},{"$f":"SUMIF('Schadensermittl.  NichtWGebäude'!$B$7:$B$8,'Daten für Bruttowertschöpfung'!$B6,'Schadensermittl.  NichtWGebäude'!$CS$7:$CS$8)","v":0},{"$f":"SUMIF('Schadensermittl.  NichtWGebäude'!$B$7:$B$8,'Daten für Bruttowertschöpfung'!$B6,'Schadensermittl.  NichtWGebäude'!$DI$7:$DI$8)","v":0}]
[null,{"$f":"'Daten für Bruttowertschöpfung'!B7","v":"Handel; Instandhaltung und Reparatur von KFZ (G)"},{"$f":"SUMIF('Schadensermittl.  NichtWGebäude'!$B$7:$B$8,'Daten für Bruttowertschöpfung'!$B7,'Schadensermittl.  NichtWGebäude'!$Q$7:$Q$8)","v":0},{"$f":"SUMIF('Schadensermittl.  NichtWGebäude'!$B$7:$B$8,'Daten für Bruttowertschöpfung'!$B7,'Schadensermittl.  NichtWGebäude'!$AG$7:$AG$8)","v":0},{"$f":"SUMIF('Schadensermittl.  NichtWGebäude'!$B$7:$B$8,'Daten für Bruttowertschöpfung'!$B7,'Schadensermittl.  NichtWGebäude'!$AW$7:$AW$8)","v":0},{"$f":"SUMIF('Schadensermittl.  NichtWGebäude'!$B$7:$B$8,'Daten für Bruttowertschöpfung'!$B7,'Schadensermittl.  NichtWGebäude'!$BM$7:$BM$8)","v":0},{"$f":"SUMIF('Schadensermittl.  NichtWGebäude'!$B$7:$B$8,'Daten für Bruttowertschöpfung'!$B7,'Schadensermittl.  NichtWGebäude'!$CC$7:$CC$8)","v":0},{"$f":"SUMIF('Schadensermittl.  NichtWGebäude'!$B$7:$B$8,'Daten für Bruttowertschöpfung'!$B7,'Schadensermittl.  NichtWGebäude'!$CS$7:$CS$8)","v":0},{"$f":"SUMIF('Schadensermittl.  NichtWGebäude'!$B$7:$B$8,'Daten für Bruttowertschöpfung'!$B7,'Schadensermittl.  NichtWGebäude'!$DI$7:$DI$8)","v":0}]
[null,{"$f":"'Daten für Bruttowertschöpfung'!B8","v":"Verkehr und Lagerei (H)"},{"$f":"SUMIF('Schadensermittl.  NichtWGebäude'!$B$7:$B$8,'Daten für Bruttowertschöpfung'!$B8,'Schadensermittl.  NichtWGebäude'!$Q$7:$Q$8)","v":0},{"$f":"SUMIF('Schadensermittl.  NichtWGebäude'!$B$7:$B$8,'Daten für Bruttowertschöpfung'!$B8,'Schadensermittl.  NichtWGebäude'!$AG$7:$AG$8)","v":0},{"$f":"SUMIF('Schadensermittl.  NichtWGebäude'!$B$7:$B$8,'Daten für Bruttowertschöpfung'!$B8,'Schadensermittl.  NichtWGebäude'!$AW$7:$AW$8)","v":0},{"$f":"SUMIF('Schadensermittl.  NichtWGebäude'!$B$7:$B$8,'Daten für Bruttowertschöpfung'!$B8,'Schadensermittl.  NichtWGebäude'!$BM$7:$BM$8)","v":0},{"$f":"SUMIF('Schadensermittl.  NichtWGebäude'!$B$7:$B$8,'Daten für Bruttowertschöpfung'!$B8,'Schadensermittl.  NichtWGebäude'!$CC$7:$CC$8)","v":0},{"$f":"SUMIF('Schadensermittl.  NichtWGebäude'!$B$7:$B$8,'Daten für Bruttowertschöpfung'!$B8,'Schadensermittl.  NichtWGebäude'!$CS$7:$CS$8)","v":0},{"$f":"SUMIF('Schadensermittl.  NichtWGebäude'!$B$7:$B$8,'Daten für Bruttowertschöpfung'!$B8,'Schadensermittl.  NichtWGebäude'!$DI$7:$DI$8)","v":0}]
[null,{"$f":"'Daten für Bruttowertschöpfung'!B9","v":"Beherbergung und Gastronomie (I)"},{"$f":"SUMIF('Schadensermittl.  NichtWGebäude'!$B$7:$B$8,'Daten für Bruttowertschöpfung'!$B9,'Schadensermittl.  NichtWGebäude'!$Q$7:$Q$8)","v":0},{"$f":"SUMIF('Schadensermittl.  NichtWGebäude'!$B$7:$B$8,'Daten für Bruttowertschöpfung'!$B9,'Schadensermittl.  NichtWGebäude'!$AG$7:$AG$8)","v":0},{"$f":"SUMIF('Schadensermittl.  NichtWGebäude'!$B$7:$B$8,'Daten für Bruttowertschöpfung'!$B9,'Schadensermittl.  NichtWGebäude'!$AW$7:$AW$8)","v":0},{"$f":"SUMIF('Schadensermittl.  NichtWGebäude'!$B$7:$B$8,'Daten für Bruttowertschöpfung'!$B9,'Schadensermittl.  NichtWGebäude'!$BM$7:$BM$8)","v":0},{"$f":"SUMIF('Schadensermittl.  NichtWGebäude'!$B$7:$B$8,'Daten für Bruttowertschöpfung'!$B9,'Schadensermittl.  NichtWGebäude'!$CC$7:$CC$8)","v":0},{"$f":"SUMIF('Schadensermittl.  NichtWGebäude'!$B$7:$B$8,'Daten für Bruttowertschöpfung'!$B9,'Schadensermittl.  NichtWGebäude'!$CS$7:$CS$8)","v":0},{"$f":"SUMIF('Schadensermittl.  NichtWGebäude'!$B$7:$B$8,'Daten für Bruttowertschöpfung'!$B9,'Schadensermittl.  NichtWGebäude'!$DI$7:$DI$8)","v":0}]
[null,{"$f":"'Daten für Bruttowertschöpfung'!B10","v":"Information und Kommunikation (J)"},{"$f":"SUMIF('Schadensermittl.  NichtWGebäude'!$B$7:$B$8,'Daten für Bruttowertschöpfung'!$B10,'Schadensermittl.  NichtWGebäude'!$Q$7:$Q$8)","v":0},{"$f":"SUMIF('Schadensermittl.  NichtWGebäude'!$B$7:$B$8,'Daten für Bruttowertschöpfung'!$B10,'Schadensermittl.  NichtWGebäude'!$AG$7:$AG$8)","v":0},{"$f":"SUMIF('Schadensermittl.  NichtWGebäude'!$B$7:$B$8,'Daten für Bruttowertschöpfung'!$B10,'Schadensermittl.  NichtWGebäude'!$AW$7:$AW$8)","v":0},{"$f":"SUMIF('Schadensermittl.  NichtWGebäude'!$B$7:$B$8,'Daten für Bruttowertschöpfung'!$B10,'Schadensermittl.  NichtWGebäude'!$BM$7:$BM$8)","v":0},{"$f":"SUMIF('Schadensermittl.  NichtWGebäude'!$B$7:$B$8,'Daten für Bruttowertschöpfung'!$B10,'Schadensermittl.  NichtWGebäude'!$CC$7:$CC$8)","v":0},{"$f":"SUMIF('Schadensermittl.  NichtWGebäude'!$B$7:$B$8,'Daten für Bruttowertschöpfung'!$B10,'Schadensermittl.  NichtWGebäude'!$CS$7:$CS$8)","v":0},{"$f":"SUMIF('Schadensermittl.  NichtWGebäude'!$B$7:$B$8,'Daten für Bruttowertschöpfung'!$B10,'Schadensermittl.  NichtWGebäude'!$DI$7:$DI$8)","v":0}]
[null,{"$f":"'Daten für Bruttowertschöpfung'!B11","v":"Erbringung von Finanz- und Versicherungsdienstl. (K)"},{"$f":"SUMIF('Schadensermittl.  NichtWGebäude'!$B$7:$B$8,'Daten für Bruttowertschöpfung'!$B11,'Schadensermittl.  NichtWGebäude'!$Q$7:$Q$8)","v":0},{"$f":"SUMIF('Schadensermittl.  NichtWGebäude'!$B$7:$B$8,'Daten für Bruttowertschöpfung'!$B11,'Schadensermittl.  NichtWGebäude'!$AG$7:$AG$8)","v":0},{"$f":"SUMIF('Schadensermittl.  NichtWGebäude'!$B$7:$B$8,'Daten für Bruttowertschöpfung'!$B11,'Schadensermittl.  NichtWGebäude'!$AW$7:$AW$8)","v":0},{"$f":"SUMIF('Schadensermittl.  NichtWGebäude'!$B$7:$B$8,'Daten für Bruttowertschöpfung'!$B11,'Schadensermittl.  NichtWGebäude'!$BM$7:$BM$8)","v":0},{"$f":"SUMIF('Schadensermittl.  NichtWGebäude'!$B$7:$B$8,'Daten für Bruttowertschöpfung'!$B11,'Schadensermittl.  NichtWGebäude'!$CC$7:$CC$8)","v":0},{"$f":"SUMIF('Schadensermittl.  NichtWGebäude'!$B$7:$B$8,'Daten für Bruttowertschöpfung'!$B11,'Schadensermittl.  NichtWGebäude'!$CS$7:$CS$8)","v":0},{"$f":"SUMIF('Schadensermittl.  NichtWGebäude'!$B$7:$B$8,'Daten für Bruttowertschöpfung'!$B11,'Schadensermittl.  NichtWGebäude'!$DI$7:$DI$8)","v":0}]
[null,{"$f":"'Daten für Bruttowertschöpfung'!B12","v":"Grundstücks- und Wohnungswesen (L)"},{"$f":"SUMIF('Schadensermittl.  NichtWGebäude'!$B$7:$B$8,'Daten für Bruttowertschöpfung'!$B12,'Schadensermittl.  NichtWGebäude'!$Q$7:$Q$8)","v":0},{"$f":"SUMIF('Schadensermittl.  NichtWGebäude'!$B$7:$B$8,'Daten für Bruttowertschöpfung'!$B12,'Schadensermittl.  NichtWGebäude'!$AG$7:$AG$8)","v":0},{"$f":"SUMIF('Schadensermittl.  NichtWGebäude'!$B$7:$B$8,'Daten für Bruttowertschöpfung'!$B12,'Schadensermittl.  NichtWGebäude'!$AW$7:$AW$8)","v":0},{"$f":"SUMIF('Schadensermittl.  NichtWGebäude'!$B$7:$B$8,'Daten für Bruttowertschöpfung'!$B12,'Schadensermittl.  NichtWGebäude'!$BM$7:$BM$8)","v":0},{"$f":"SUMIF('Schadensermittl.  NichtWGebäude'!$B$7:$B$8,'Daten für Bruttowertschöpfung'!$B12,'Schadensermittl.  NichtWGebäude'!$CC$7:$CC$8)","v":0},{"$f":"SUMIF('Schadensermittl.  NichtWGebäude'!$B$7:$B$8,'Daten für Bruttowertschöpfung'!$B12,'Schadensermittl.  NichtWGebäude'!$CS$7:$CS$8)","v":0},{"$f":"SUMIF('Schadensermittl.  NichtWGebäude'!$B$7:$B$8,'Daten für Bruttowertschöpfung'!$B12,'Schadensermittl.  NichtWGebäude'!$DI$7:$DI$8)","v":0}]
[null,{"$f":"'Daten für Bruttowertschöpfung'!B13","v":"Erbringung v. freiberuflichen, wissenschaftl. und techn.Dienstl. (M)"},{"$f":"SUMIF('Schadensermittl.  NichtWGebäude'!$B$7:$B$8,'Daten für Bruttowertschöpfung'!$B13,'Schadensermittl.  NichtWGebäude'!$Q$7:$Q$8)","v":0},{"$f":"SUMIF('Schadensermittl.  NichtWGebäude'!$B$7:$B$8,'Daten für Bruttowertschöpfung'!$B13,'Schadensermittl.  NichtWGebäude'!$AG$7:$AG$8)","v":0},{"$f":"SUMIF('Schadensermittl.  NichtWGebäude'!$B$7:$B$8,'Daten für Bruttowertschöpfung'!$B13,'Schadensermittl.  NichtWGebäude'!$AW$7:$AW$8)","v":0},{"$f":"SUMIF('Schadensermittl.  NichtWGebäude'!$B$7:$B$8,'Daten für Bruttowertschöpfung'!$B13,'Schadensermittl.  NichtWGebäude'!$BM$7:$BM$8)","v":0},{"$f":"SUMIF('Schadensermittl.  NichtWGebäude'!$B$7:$B$8,'Daten für Bruttowertschöpfung'!$B13,'Schadensermittl.  NichtWGebäude'!$CC$7:$CC$8)","v":0},{"$f":"SUMIF('Schadensermittl.  NichtWGebäude'!$B$7:$B$8,'Daten für Bruttowertschöpfung'!$B13,'Schadensermittl.  NichtWGebäude'!$CS$7:$CS$8)","v":0},{"$f":"SUMIF('Schadensermittl.  NichtWGebäude'!$B$7:$B$8,'Daten für Bruttowertschöpfung'!$B13,'Schadensermittl.  NichtWGebäude'!$DI$7:$DI$8)","v":0}]
[null,{"$f":"'Daten für Bruttowertschöpfung'!B14","v":"Erbringung von sonstigen wirtschaftl. Dienstleistungen (N)"},{"$f":"SUMIF('Schadensermittl.  NichtWGebäude'!$B$7:$B$8,'Daten für Bruttowertschöpfung'!$B14,'Schadensermittl.  NichtWGebäude'!$Q$7:$Q$8)","v":0},{"$f":"SUMIF('Schadensermittl.  NichtWGebäude'!$B$7:$B$8,'Daten für Bruttowertschöpfung'!$B14,'Schadensermittl.  NichtWGebäude'!$AG$7:$AG$8)","v":0},{"$f":"SUMIF('Schadensermittl.  NichtWGebäude'!$B$7:$B$8,'Daten für Bruttowertschöpfung'!$B14,'Schadensermittl.  NichtWGebäude'!$AW$7:$AW$8)","v":0},{"$f":"SUMIF('Schadensermittl.  NichtWGebäude'!$B$7:$B$8,'Daten für Bruttowertschöpfung'!$B14,'Schadensermittl.  NichtWGebäude'!$BM$7:$BM$8)","v":0},{"$f":"SUMIF('Schadensermittl.  NichtWGebäude'!$B$7:$B$8,'Daten für Bruttowertschöpfung'!$B14,'Schadensermittl.  NichtWGebäude'!$CC$7:$CC$8)","v":0},{"$f":"SUMIF('Schadensermittl.  NichtWGebäude'!$B$7:$B$8,'Daten für Bruttowertschöpfung'!$B14,'Schadensermittl.  NichtWGebäude'!$CS$7:$CS$8)","v":0},{"$f":"SUMIF('Schadensermittl.  NichtWGebäude'!$B$7:$B$8,'Daten für Bruttowertschöpfung'!$B14,'Schadensermittl.  NichtWGebäude'!$DI$7:$DI$8)","v":0}]
[null,{"$f":"'Daten für Bruttowertschöpfung'!B15","v":"Reparatur von Gebrauchsgütern (S95)"},{"$f":"SUMIF('Schadensermittl.  NichtWGebäude'!$B$7:$B$8,'Daten für Bruttowertschöpfung'!$B15,'Schadensermittl.  NichtWGebäude'!$Q$7:$Q$8)","v":0},{"$f":"SUMIF('Schadensermittl.  NichtWGebäude'!$B$7:$B$8,'Daten für Bruttowertschöpfung'!$B15,'Schadensermittl.  NichtWGebäude'!$AG$7:$AG$8)","v":0},{"$f":"SUMIF('Schadensermittl.  NichtWGebäude'!$B$7:$B$8,'Daten für Bruttowertschöpfung'!$B15,'Schadensermittl.  NichtWGebäude'!$AW$7:$AW$8)","v":0},{"$f":"SUMIF('Schadensermittl.  NichtWGebäude'!$B$7:$B$8,'Daten für Bruttowertschöpfung'!$B15,'Schadensermittl.  NichtWGebäude'!$BM$7:$BM$8)","v":0},{"$f":"SUMIF('Schadensermittl.  NichtWGebäude'!$B$7:$B$8,'Daten für Bruttowertschöpfung'!$B15,'Schadensermittl.  NichtWGebäude'!$CC$7:$CC$8)","v":0},{"$f":"SUMIF('Schadensermittl.  NichtWGebäude'!$B$7:$B$8,'Daten für Bruttowertschöpfung'!$B15,'Schadensermittl.  NichtWGebäude'!$CS$7:$CS$8)","v":0},{"$f":"SUMIF('Schadensermittl.  NichtWGebäude'!$B$7:$B$8,'Daten für Bruttowertschöpfung'!$B15,'Schadensermittl.  NichtWGebäude'!$DI$7:$DI$8)","v":0}]
[null,"Summe betroffene Beschäftigte",{"$f":"SUM(C9:C22)","v":0},0,0,0,0,0,0]
[]
["Erläuterungen zur Ausweisung Indirekt Betroffener"]

{"sheet":"Schadensrel. Merkmale WGebäude","index":5,"n_rows":8,"n_cols":31,"rows_kept":8,"cut":false,"hidden":false,"merged":[[4,29,5,29],[4,30,5,30],[5,1,5,18],[4,19,5,19],[4,21,5,21],[4,24,5,24],[4,25,5,25],[4,27,5,27],[4,28,5,28],[4,20,5,20],[4,23,5,23],[4,22,5,22],[4,26,5,26],[1,0,1,18],[2,0,2,18],[2,19,2,30],[3,0,3,18],[3,19,3,21],[3,23,3,25],[3,27,3,29]]}
["SCHADENSRELEVANTE MERKMALE WOHNGEBÄUDE"]
[]
["Hinweis: Wohngebäude dürfen nur bei gleichen Gebäudeeigenschaften, gleichem Schadensbild (Höhe der Schadensbeurteilung) UND gleicher Überflutungshöhe an den Stützstellen zu Clustern ",null,null,null,null,null,null,null,null,null,null,null,null,null,null,null,null,null,null,"Schadensbeurteilungen"]
["zusammengefasst werden.",null,null,null,null,null,null,null,null,null,null,null,null,null,null,null,null,null,null,"Keller",null,null,null,"Erdgeschoss",null,null,null,"Stockwerk",null,null,"Aussenanlagen"]
["Adresse","Gebäudetyp (Einfamilienhaus, Mehrfamilienhaus, Reihenhaus, ...)","Anzahl Wohneinheiten an der Adresse","Jahr der Errichtung bzw.\nletzte Generalsanierung","Bauwerkstyp","Erhaltungszustand des Gebäudes","Anzahl Wohneinheiten an der Adresse","Gewerbliche Nutzung","Keller vohanden","Höhe Keller (in m)\n(SIEHE ERLÄUTERUNGEN)","Decke Keller (in m)","Höhe Erdgeschoss (in m)","Decke Erdgeschoss (in m)","Höhe 1. Stock (in m)","Lage Fussbodenoberkante EG","Höhe erste Fussbodenoberkante über Gelände (in m)","Wassereintritt in den Keller nur vom Hausinneren, aus dem EG möglich?","Außenanlagen (Ja/Nein)","bekannte Hochwasserschäden\n(Jahr, Wassertiefe über Fußboden EG, Schaden in Keller, EG, Stockwerk)","Keller\nAnfangsschaden \n(Smin) in €","Keller\nAnfangsschaden \n(Smin) in € bei EFH","Keller\nSchaden bei 1m Wassertiefe in 1.000 €\n(B)","Keller\nSchaden bei 1m Wassertiefe in 1.000 €\n(B)","Erdgeschoß\nAnfangsschaden \n(Smin) in € bei EFH","Erdgeschoß\nAnfangsschaden \n(Smin) in € bei EFH","Erdgeschoß\nSchaden bei 1m Wassertiefe in 1.000 €\n(B)","Erdgeschoß\nSchaden bei 1m Wassertiefe in 1.000 €\n(B)","1: Stock\nAnfangsschaden \n(Smin) in €","Höhe über GOK","1. Stock\nSchaden bei 1m Wassertiefe in 1.000 €\n(B)","Außenanlagen\nSchaden in €"]
["Gemeinde, Straße, Hausnummer"]
[null,"EFH",null,null,"ZH","sehr gut",null,"Nein","Ja",null,null,null,null,null,"Ebenerdig",null,"Nein","Nein"]
[null,"Sonst.",null,null,"BH","sehr gut",null,"Nein","Ja",null,null,null,null,null,"Ebenerdig",null,"Nein","Nein"]

{"sheet":"Schadensermittlung Wohngebäude","index":6,"n_rows":67,"n_cols":114,"rows_kept":67,"cut":false,"hidden":false,"merged":[[12,111,12,113],[10,98,10,113],[11,2,11,17],[11,18,11,33],[11,34,11,49],[11,50,11,65],[11,66,11,81],[11,82,11,97],[11,98,11,113],[10,2,10,17],[10,18,10,33],[10,34,10,49],[10,50,10,65],[10,66,10,81],[10,82,10,97],[0,98,0,113],[4,2,4,17],[4,18,4,33],[4,34,4,49],[4,50,4,65],[4,66,4,81],[4,82,4,97],[4,98,4,113],[0,2,0,17],[0,18,0,33],[0,34,0,49],[0,50,0,65],[0,66,0,81],[0,82,0,97]]}
["SCHADENSERMITTLUNG WOHNGEBÄUDE",null,{"$f":"$A$1","v":"SCHADENSERMITTLUNG WOHNGEBÄUDE"},null,null,null,null,null,null,null,null,null,null,null,null,null,null,null,{"$f":"$A$1","v":"SCHADENSERMITTLUNG WOHNGEBÄUDE"},null,null,null,null,null,null,null,null,null,null,null,null,null,null,null,{"$f":"S1","v":"SCHADENSERMITTLUNG WOHNGEBÄUDE"},null,null,null,null,null,null,null,null,null,null,null,null,null,null,null,{"$f":"AI1","v":"SCHADENSERMITTLUNG WOHNGEBÄUDE"},null,null,null,null,null,null,null,null,null,null,null,null,null,null,null,{"$f":"AY1","v":"SCHADENSERMITTLUNG WOHNGEBÄUDE"},null,null,null,null,null,null,null,null,null,null,null,null,null,null,null,{"$f":"BO1","v":"SCHADENSERMITTLUNG WOHNGEBÄUDE"},null,null,null,null,null,null,null,null,null,null,null,null,null,null,null,{"$f":"CE1","v":"SCHADENSERMITTLUNG WOHNGEBÄUDE"}]
[]
[]
[]
[null,"bei HQx",{"$f":"Projektgrunddaten!$C$24","v":0},null,null,null,null,null,null,null,null,null,null,null,null,null,null,null,{"$f":"Projektgrunddaten!$C$25","v":0},null,null,null,null,null,null,null,null,null,null,null,null,null,null,null,{"$f":"Projektgrunddaten!$C$26","v":0},null,null,null,null,null,null,null,null,null,null,null,null,null,null,null,{"$f":"Projektgrunddaten!$C$27","v":0},null,null,null,null,null,null,null,null,null,null,null,null,null,null,null,{"$f":"Projektgrunddaten!$C$28","v":0},null,null,null,null,null,null,null,null,null,null,null,null,null,null,null,{"$f":"Projektgrunddaten!$C$29","v":100},null,null,null,null,null,null,null,null,null,null,null,null,null,null,null,{"$f":"Projektgrunddaten!$C$30","v":0}]
["Adresse","Gebäudetyp","Anzahl gleich bewertete Objekte","Wassertiefe über GOK (m)","Wasserstand Keller","ALTERNATIV zur Wassertiefe: Wasserstand Keller (in m)","Schaden Keller (€)","Wasserstand EG","ALTERNATIV zur Wassertiefe:\nWasserstand Erdgeschoß (m)","Schaden Erdgeschoss (€)","Wasserstand 1.Stock","ALTERNATIV zur Wassertiefe: \nWasserstand 1. Stock (m)","Schaden 1. Stock (€)","Schaden Aussenanlagen (€)","Reduktionsfaktor wegen Eigenvorsorge ","Schaden gesamt (€)","Schadenssumme gesamt","ALTERNATIVE EINGABE: Gesamtschaden aus anderen Erhebungsmodellen (€)","Anzahl gleich bewertete Objekte","Wassertiefe über GOK (m)","Wasserstand Keller","ALTERNATIV zur Wassertiefe: Wasserstand Keller (in m)","Schaden Keller (€)","Wasserstand EG","ALTERNATIV zur Wassertiefe:\nWasserstand Erdgeschoß (m)","Schaden Erdgeschoss (€)","Wasserstand 1.Stock","ALTERNATIV zur Wassertiefe: \nWasserstand 1. Stock (m)","Schaden 1. Stock (€)","Schaden Aussenanlagen (€)","Reduktionsfaktor wegen Eigenvorsorge ","Schaden gesamt (€)","Schadenssumme gesamt","ALTERNATIVE EINGABE: Gesamtschaden aus anderen Erhebungsmodellen (€)","Anzahl gleich bewertete Objekte","Wassertiefe über GOK (m)","Wasserstand Keller","ALTERNATIV zur Wassertiefe: Wasserstand Keller (in m)","Schaden Keller (€)","Wasserstand EG","ALTERNATIV zur Wassertiefe:\nWasserstand Erdgeschoß (m)","Schaden Erdgeschoss (€)","Wasserstand 1.Stock","ALTERNATIV zur Wassertiefe: \nWasserstand 1. Stock (m)","Schaden 1. Stock (€)","Schaden Aussenanlagen (€)","Reduktionsfaktor wegen Eigenvorsorge ","Schaden gesamt (€)","Schadenssumme gesamt","ALTERNATIVE EINGABE: Gesamtschaden aus anderen Erhebungsmodellen (€)","Anzahl gleich bewertete Objekte","Wassertiefe über GOK (m)","Wasserstand Keller","ALTERNATIV zur Wassertiefe: Wasserstand Keller (in m)","Schaden Keller (€)","Wasserstand EG","ALTERNATIV zur Wassertiefe:\nWasserstand Erdgeschoß (m)","Schaden Erdgeschoss (€)","Wasserstand 1.Stock","ALTERNATIV zur Wassertiefe: \nWasserstand 1. Stock (m)","Schaden 1. Stock (€)","Schaden Aussenanlagen (€)","Reduktionsfaktor wegen Eigenvorsorge ","Schaden gesamt (€)","Schadenssumme gesamt","ALTERNATIVE EINGABE: Gesamtschaden aus anderen Erhebungsmodellen (€)","Anzahl gleich bewertete Objekte","Wassertiefe über GOK (m)","Wasserstand Keller","ALTERNATIV zur Wassertiefe: Wasserstand Keller (in m)","Schaden Keller (€)","Wasserstand EG","ALTERNATIV zur Wassertiefe:\nWasserstand Erdgeschoß (m)","Schaden Erdgeschoss (€)","Wasserstand 1.Stock","ALTERNATIV zur Wassertiefe: \nWasserstand 1. Stock (m)","Schaden 1. Stock (€)","Schaden Aussenanlagen (€)","Reduktionsfaktor wegen Eigenvorsorge ","Schaden gesamt (€)","Schadenssumme gesamt","ALTERNATIVE EINGABE: Gesamtschaden aus anderen Erhebungsmodellen (€)","Anzahl gleich bewertete Objekte","Wassertiefe über GOK (m)","Wasserstand Keller","ALTERNATIV zur Wassertiefe: Wasserstand Keller (in m)","Schaden Keller (€)","Wasserstand EG","ALTERNATIV zur Wassertiefe:\nWasserstand Erdgeschoß (m)","Schaden Erdgeschoss (€)","Wasserstand 1.Stock","ALTERNATIV zur Wassertiefe: \nWasserstand 1. Stock (m)","Schaden 1. Stock (€)","Schaden Aussenanlagen (€)","Reduktionsfaktor wegen Eigenvorsorge ","Schaden gesamt (€)","Schadenssumme gesamt","ALTERNATIVE EINGABE: Gesamtschaden aus anderen Erhebungsmodellen (€)","Anzahl gleich bewertete Objekte","Wassertiefe über GOK (m)","Wasserstand Keller","ALTERNATIV zur Wassertiefe: Wasserstand Keller (in m)","Schaden Keller (€)","Wasserstand EG","ALTERNATIV zur Wassertiefe:\nWasserstand Erdgeschoß (m)","Schaden Erdgeschoss (€)","Wasserstand 1.Stock","ALTERNATIV zur Wassertiefe: \nWasserstand 1. Stock (m)","Schaden 1. Stock (€)","Schaden Aussenanlagen (€)","Reduktionsfaktor wegen Eigenvorsorge ","Schaden gesamt (€)","Schadenssumme gesamt","ALTERNATIVE EINGABE: Gesamtschaden aus anderen Erhebungsmodellen (€)"]
[{"$f":"IF('Schadensrel. Merkmale WGebäude'!A7=\"\",\"\",'Schadensrel. Merkmale WGebäude'!A7)","v":""},{"$f":"IF('Schadensrel. Merkmale WGebäude'!B7=\"\",\"\",'Schadensrel. Merkmale WGebäude'!B7)","v":"EFH"},null,null,{"$f":"IF(D7=0,0,IF(('Schadensrel. Merkmale WGebäude'!$J7+'Schadensrel. Merkmale WGebäude'!$K7)=0,(IF((Berechnungsgrundlagen!$B$18+Berechnungsgrundlagen!$B$19-'Schadensrel. Merkmale WGebäude'!$P7+D7)>(Berechnungsgrundlagen!$B$18+Berechnungsgrundlagen!$B$19),(Berechnungsgrundlagen!$B$18+Berechnungsgrundlagen!$B$19),(Berechnungsgrundlagen!$B$18+Berechnungsgrundlagen!$B$19-'Schadensrel. Merkmale WGebäude'!$P7+D7))),(IF(('Schadensrel. Merkmale WGebäude'!$J7+'Schadensrel. Merkmale WGebäude'!$K7-'Schadensrel. Merkmale WGebäude'!$P7+D7)>('Schadensrel. Merkmale WGebäude'!$J7+'Schadensrel. Merkmale WGebäude'!$K7),('Schadensrel. Merkmale WGebäude'!$J7+'Schadensrel. Merkmale WGebäude'!$K7),('Schadensrel. Merkmale WGebäude'!$J7+'Schadensrel. Merkmale WGebäude'!$K7-'Schadensrel. Merkmale WGebäude'!$P7+D7)))))","v":0},null,{"$f":"IF('Schadensrel. Merkmale WGebäude'!$I7=Berechnungsgrundlagen!$D$17, IF(F7>0,'Schadensrel. Merkmale WGebäude'!$T7+(1000*'Schadensrel. Merkmale WGebäude'!$V7*SQRT(F7)),IF(E7=0,0,IF('Schadensrel. Merkmale WGebäude'!$Q7=Berechnungsgrundlagen!$D$18,'Schadensrel. Merkmale WGebäude'!$T7+(1000*'Schadensrel. Merkmale WGebäude'!$V7*SQRT(E7)),IF(D7<='Schadensrel. Merkmale WGebäude'!$P7,0,'Schadensrel. Merkmale WGebäude'!$T7+(1000*'Schadensrel. Merkmale WGebäude'!$V7*SQRT(E7)))))),0)","v":0},{"$f":"IF(D7=0,0,IF((D7-'Schadensrel. Merkmale WGebäude'!$P7)<=0,0,IF(((D7-'Schadensrel. Merkmale WGebäude'!$P7))>(IF(('Schadensrel. Merkmale WGebäude'!$L7+'Schadensrel. Merkmale WGebäude'!$M7)=0,(Berechnungsgrundlagen!$B$20+Berechnungsgrundlagen!$B$21),('Schadensrel. Merkmale WGebäude'!$L7+'Schadensrel. Merkmale WGebäude'!$M7))),IF(('Schadensrel. Merkmale WGebäude'!$L7+'Schadensrel. Merkmale WGebäude'!$M7)=0,(Berechnungsgrundlagen!$B$20+Berechnungsgrundlagen!$B$21),('Schadensrel. Merkmale WGebäude'!$L7+'Schadensrel. Merkmale WGebäude'!$M7)),((D7-'Schadensrel. Merkmale WGebäude'!$P7)))))","v":0},null,{"$f":"IF(I7>0,'Schadensrel. Merkmale WGebäude'!$X7+(1000*'Schadensrel. Merkmale WGebäude'!$Z7*SQRT(I7)),IF(H7=0,0,IF(D7<='Schadensrel. Merkmale WGebäude'!$P7,0,'Schadensrel. Merkmale WGebäude'!$X7+(1000*'Schadensrel. Merkmale WGebäude'!$Z7*SQRT(H7)))))","v":0},{"$f":"IF(D7=0,0,D7-('Schadensrel. Merkmale WGebäude'!$P7+IF(('Schadensrel. Merkmale WGebäude'!$L7+'Schadensrel. Merkmale WGebäude'!$M7)=0,Berechnungsgrundlagen!$B$20+Berechnungsgrundlagen!$B$21,'Schadensrel. Merkmale WGebäude'!$L7+'Schadensrel. Merkmale WGebäude'!$M7)))","v":0},null,{"$f":"IF(L7>0,'Schadensrel. Merkmale WGebäude'!$AB7+(1000*'Schadensrel. Merkmale WGebäude'!$AD7*SQRT(L7)),IF(D7<=('Schadensrel. Merkmale WGebäude'!$P7+IF(('Schadensrel. Merkmale WGebäude'!$L7+'Schadensrel. Merkmale WGebäude'!$M7)=0,Berechnungsgrundlagen!$B$20+Berechnungsgrundlagen!$B$21,'Schadensrel. Merkmale WGebäude'!$L7+'Schadensrel. Merkmale WGebäude'!$M7)),0,('Schadensrel. Merkmale WGebäude'!$AB7+(1000*'Schadensrel. Merkmale WGebäude'!$AD7*SQRT(K7)))))","v":0},{"$f":"IF(D7=0,0,'Schadensrel. Merkmale WGebäude'!$AE7)","v":0},null,{"$f":"SUM((G7+J7+M7+N7)*(IF(C7=0,1,C7)*(IF($C$5>50,1,IF(O7=0,1,1-O7)))))","v":0},{"$f":"MAX(P7,R7)","v":0},null,null,null,{"$f":"IF(T7=0,0,IF(('Schadensrel. Merkmale WGebäude'!$J7+'Schadensrel. Merkmale WGebäude'!$K7)=0,(IF((Berechnungsgrundlagen!$B$18+Berechnungsgrundlagen!$B$19-'Schadensrel. Merkmale WGebäude'!$P7+T7)>(Berechnungsgrundlagen!$B$18+Berechnungsgrundlagen!$B$19),(Berechnungsgrundlagen!$B$18+Berechnungsgrundlagen!$B$19),(Berechnungsgrundlagen!$B$18+Berechnungsgrundlagen!$B$19-'Schadensrel. Merkmale WGebäude'!$P7+T7))),(IF(('Schadensrel. Merkmale WGebäude'!$J7+'Schadensrel. Merkmale WGebäude'!$K7-'Schadensrel. Merkmale WGebäude'!$P7+T7)>('Schadensrel. Merkmale WGebäude'!$J7+'Schadensrel. Merkmale WGebäude'!$K7),('Schadensrel. Merkmale WGebäude'!$J7+'Schadensrel. Merkmale WGebäude'!$K7),('Schadensrel. Merkmale WGebäude'!$J7+'Schadensrel. Merkmale WGebäude'!$K7-'Schadensrel. Merkmale WGebäude'!$P7+T7)))))","v":0},null,{"$f":"IF('Schadensrel. Merkmale WGebäude'!$I7=Berechnungsgrundlagen!$D$17, IF(V7>0,'Schadensrel. Merkmale WGebäude'!$T7+(1000*'Schadensrel. Merkmale WGebäude'!$V7*SQRT(V7)),IF(U7=0,0,IF('Schadensrel. Merkmale WGebäude'!$Q7=Berechnungsgrundlagen!$D$18,'Schadensrel. Merkmale WGebäude'!$T7+(1000*'Schadensrel. Merkmale WGebäude'!$V7*SQRT(U7)),IF(T7<='Schadensrel. Merkmale WGebäude'!$P7,0,'Schadensrel. Merkmale WGebäude'!$T7+(1000*'Schadensrel. Merkmale WGebäude'!$V7*SQRT(U7)))))),0)","v":0},{"$f":"IF(T7=0,0,IF((T7-'Schadensrel. Merkmale WGebäude'!$P7)<=0,0,IF(((T7-'Schadensrel. Merkmale WGebäude'!$P7))>(IF(('Schadensrel. Merkmale WGebäude'!$L7+'Schadensrel. Merkmale WGebäude'!$M7)=0,(Berechnungsgrundlagen!$B$20+Berechnungsgrundlagen!$B$21),('Schadensrel. Merkmale WGebäude'!$L7+'Schadensrel. Merkmale WGebäude'!$M7))),IF(('Schadensrel. Merkmale WGebäude'!$L7+'Schadensrel. Merkmale WGebäude'!$M7)=0,(Berechnungsgrundlagen!$B$20+Berechnungsgrundlagen!$B$21),('Schadensrel. Merkmale WGebäude'!$L7+'Schadensrel. Merkmale WGebäude'!$M7)),((T7-'Schadensrel. Merkmale WGebäude'!$P7)))))","v":0},null,{"$f":"IF(Y7>0,'Schadensrel. Merkmale WGebäude'!$X7+(1000*'Schadensrel. Merkmale WGebäude'!$Z7*SQRT(Y7)),IF(X7=0,0,IF(T7<='Schadensrel. Merkmale WGebäude'!$P7,0,'Schadensrel. Merkmale WGebäude'!$X7+(1000*'Schadensrel. Merkmale WGebäude'!$Z7*SQRT(X7)))))","v":0},{"$f":"IF(T7=0,0,T7-('Schadensrel. Merkmale WGebäude'!$P7+IF(('Schadensrel. Merkmale WGebäude'!$L7+'Schadensrel. Merkmale WGebäude'!$M7)=0,Berechnungsgrundlagen!$B$20+Berechnungsgrundlagen!$B$21,'Schadensrel. Merkmale WGebäude'!$L7+'Schadensrel. Merkmale WGebäude'!$M7)))","v":0},null,{"$f":"IF(AB7>0,'Schadensrel. Merkmale WGebäude'!$AB7+(1000*'Schadensrel. Merkmale WGebäude'!$AD7*SQRT(AB7)),IF(T7<=('Schadensrel. Merkmale WGebäude'!$P7+IF(('Schadensrel. Merkmale WGebäude'!$L7+'Schadensrel. Merkmale WGebäude'!$M7)=0,Berechnungsgrundlagen!$B$20+Berechnungsgrundlagen!$B$21,'Schadensrel. Merkmale WGebäude'!$L7+'Schadensrel. Merkmale WGebäude'!$M7)),0,('Schadensrel. Merkmale WGebäude'!$AB7+(1000*'Schadensrel. Merkmale WGebäude'!$AD7*SQRT(AA7)))))","v":0},{"$f":"IF(T7=0,0,'Schadensrel. Merkmale WGebäude'!$AE7)","v":0},null,{"$f":"SUM((W7+Z7+AC7+AD7)*(IF(S7=0,1,S7)*(IF($S$5>50,1,IF(AE7=0,1,(1-AE7))))))","v":0},{"$f":"MAX(AF7,AH7)","v":0},null,null,null,{"$f":"IF(AJ7=0,0,IF(('Schadensrel. Merkmale WGebäude'!$J7+'Schadensrel. Merkmale WGebäude'!$K7)=0,(IF((Berechnungsgrundlagen!$B$18+Berechnungsgrundlagen!$B$19-'Schadensrel. Merkmale WGebäude'!$P7+AJ7)>(Berechnungsgrundlagen!$B$18+Berechnungsgrundlagen!$B$19),(Berechnungsgrundlagen!$B$18+Berechnungsgrundlagen!$B$19),(Berechnungsgrundlagen!$B$18+Berechnungsgrundlagen!$B$19-'Schadensrel. Merkmale WGebäude'!$P7+AJ7))),(IF(('Schadensrel. Merkmale WGebäude'!$J7+'Schadensrel. Merkmale WGebäude'!$K7-'Schadensrel. Merkmale WGebäude'!$P7+AJ7)>('Schadensrel. Merkmale WGebäude'!$J7+'Schadensrel. Merkmale WGebäude'!$K7),('Schadensrel. Merkmale WGebäude'!$J7+'Schadensrel. Merkmale WGebäude'!$K7),('Schadensrel. Merkmale WGebäude'!$J7+'Schadensrel. Merkmale WGebäude'!$K7-'Schadensrel. Merkmale WGebäude'!$P7+AJ7)))))","v":0},null,{"$f":"IF('Schadensrel. Merkmale WGebäude'!$I7=Berechnungsgrundlagen!$D$17,IF(AL7>0,'Schadensrel. Merkmale WGebäude'!$T7+(1000*'Schadensrel. Merkmale WGebäude'!$V7*SQRT(AL7)),IF(AK7=0,0,IF('Schadensrel. Merkmale WGebäude'!$Q7=Berechnungsgrundlagen!$D$18,'Schadensrel. Merkmale WGebäude'!$T7+(1000*'Schadensrel. Merkmale WGebäude'!$V7*SQRT(AK7)),IF(AJ7<='Schadensrel. Merkmale WGebäude'!$P7,0,'Schadensrel. Merkmale WGebäude'!$T7+(1000*'Schadensrel. Merkmale WGebäude'!$V7*SQRT(AK7)))))),0)","v":0},{"$f":"IF(AJ7=0,0,IF((AJ7-'Schadensrel. Merkmale WGebäude'!$P7)<=0,0,IF(((AJ7-'Schadensrel. Merkmale WGebäude'!$P7))>(IF(('Schadensrel. Merkmale WGebäude'!$L7+'Schadensrel. Merkmale WGebäude'!$M7)=0,(Berechnungsgrundlagen!$B$20+Berechnungsgrundlagen!$B$21),('Schadensrel. Merkmale WGebäude'!$L7+'Schadensrel. Merkmale WGebäude'!$M7))),IF(('Schadensrel. Merkmale WGebäude'!$L7+'Schadensrel. Merkmale WGebäude'!$M7)=0,(Berechnungsgrundlagen!$B$20+Berechnungsgrundlagen!$B$21),('Schadensrel. Merkmale WGebäude'!$L7+'Schadensrel. Merkmale WGebäude'!$M7)),((AJ7-'Schadensrel. Merkmale WGebäude'!$P7)))))","v":0},null,{"$f":"IF(AO7>0,'Schadensrel. Merkmale WGebäude'!$X7+(1000*'Schadensrel. Merkmale WGebäude'!$Z7*SQRT(AO7)),IF(AN7=0,0,IF(AJ7<='Schadensrel. Merkmale WGebäude'!$P7,0,'Schadensrel. Merkmale WGebäude'!$X7+(1000*'Schadensrel. Merkmale WGebäude'!$Z7*SQRT(AN7)))))","v":0},{"$f":"IF(AJ7=0,0,AJ7-('Schadensrel. Merkmale WGebäude'!$P7+IF(('Schadensrel. Merkmale WGebäude'!$L7+'Schadensrel. Merkmale WGebäude'!$M7)=0,Berechnungsgrundlagen!$B$20+Berechnungsgrundlagen!$B$21,'Schadensrel. Merkmale WGebäude'!$L7+'Schadensrel. Merkmale WGebäude'!$M7)))","v":0},null,{"$f":"IF(AR7>0,'Schadensrel. Merkmale WGebäude'!$AB7+(1000*'Schadensrel. Merkmale WGebäude'!$AD7*SQRT(AR7)),IF(AJ7<=('Schadensrel. Merkmale WGebäude'!$P7+IF(('Schadensrel. Merkmale WGebäude'!$L7+'Schadensrel. Merkmale WGebäude'!$M7)=0,Berechnungsgrundlagen!$B$20+Berechnungsgrundlagen!$B$21,'Schadensrel. Merkmale WGebäude'!$L7+'Schadensrel. Merkmale WGebäude'!$M7)),0,('Schadensrel. Merkmale WGebäude'!$AB7+(1000*'Schadensrel. Merkmale WGebäude'!$AD7*SQRT(AQ7)))))","v":0},{"$f":"IF(AJ7=0,0,'Schadensrel. Merkmale WGebäude'!$AE7)","v":0},null,{"$f":"SUM((AM7+AP7+AS7+AT7)*(IF(AI7=0,1,AI7)*(IF($AI$5>50,1,IF(AU7=0,1,1-AU7)))))","v":0},{"$f":"MAX(AV7,AX7)","v":0},null,null,null,{"$f":"IF(AZ7=0,0,IF(('Schadensrel. Merkmale WGebäude'!$J7+'Schadensrel. Merkmale WGebäude'!$K7)=0,(IF((Berechnungsgrundlagen!$B$18+Berechnungsgrundlagen!$B$19-'Schadensrel. Merkmale WGebäude'!$P7+AZ7)>(Berechnungsgrundlagen!$B$18+Berechnungsgrundlagen!$B$19),(Berechnungsgrundlagen!$B$18+Berechnungsgrundlagen!$B$19),(Berechnungsgrundlagen!$B$18+Berechnungsgrundlagen!$B$19-'Schadensrel. Merkmale WGebäude'!$P7+AZ7))),(IF(('Schadensrel. Merkmale WGebäude'!$J7+'Schadensrel. Merkmale WGebäude'!$K7-'Schadensrel. Merkmale WGebäude'!$P7+AZ7)>('Schadensrel. Merkmale WGebäude'!$J7+'Schadensrel. Merkmale WGebäude'!$K7),('Schadensrel. Merkmale WGebäude'!$J7+'Schadensrel. Merkmale WGebäude'!$K7),('Schadensrel. Merkmale WGebäude'!$J7+'Schadensrel. Merkmale WGebäude'!$K7-'Schadensrel. Merkmale WGebäude'!$P7+AZ7)))))","v":0},null,{"$f":"IF('Schadensrel. Merkmale WGebäude'!$I7=Berechnungsgrundlagen!$D$17,IF(BB7>0,'Schadensrel. Merkmale WGebäude'!$T7+(1000*'Schadensrel. Merkmale WGebäude'!$V7*SQRT(BB7)),IF(BA7=0,0,IF('Schadensrel. Merkmale WGebäude'!$Q7=Berechnungsgrundlagen!$D$18,'Schadensrel. Merkmale WGebäude'!$T7+(1000*'Schadensrel. Merkmale WGebäude'!$V7*SQRT(BA7)),IF(AZ7<='Schadensrel. Merkmale WGebäude'!$P7,0,'Schadensrel. Merkmale WGebäude'!$T7+(1000*'Schadensrel. Merkmale WGebäude'!$V7*SQRT(BA7)))))),0)","v":0},{"$f":"IF(AZ7=0,0,IF((AZ7-'Schadensrel. Merkmale WGebäude'!$P7)<=0,0,IF(((AZ7-'Schadensrel. Merkmale WGebäude'!$P7))>(IF(('Schadensrel. Merkmale WGebäude'!$L7+'Schadensrel. Merkmale WGebäude'!$M7)=0,(Berechnungsgrundlagen!$B$20+Berechnungsgrundlagen!$B$21),('Schadensrel. Merkmale WGebäude'!$L7+'Schadensrel. Merkmale WGebäude'!$M7))),IF(('Schadensrel. Merkmale WGebäude'!$L7+'Schadensrel. Merkmale WGebäude'!$M7)=0,(Berechnungsgrundlagen!$B$20+Berechnungsgrundlagen!$B$21),('Schadensrel. Merkmale WGebäude'!$L7+'Schadensrel. Merkmale WGebäude'!$M7)),((AZ7-'Schadensrel. Merkmale WGebäude'!$P7)))))","v":0},null,{"$f":"IF(BE7>0,'Schadensrel. Merkmale WGebäude'!$X7+(1000*'Schadensrel. Merkmale WGebäude'!$Z7*SQRT(BE7)),IF(BD7=0,0,IF(AZ7<='Schadensrel. Merkmale WGebäude'!$P7,0,'Schadensrel. Merkmale WGebäude'!$X7+(1000*'Schadensrel. Merkmale WGebäude'!$Z7*SQRT(BD7)))))","v":0},{"$f":"IF(AZ7=0,0,AZ7-('Schadensrel. Merkmale WGebäude'!$P7+IF(('Schadensrel. Merkmale WGebäude'!$L7+'Schadensrel. Merkmale WGebäude'!$M7)=0,Berechnungsgrundlagen!$B$20+Berechnungsgrundlagen!$B$21,'Schadensrel. Merkmale WGebäude'!$L7+'Schadensrel. Merkmale WGebäude'!$M7)))","v":0},null,{"$f":"IF(BH7>0,'Schadensrel. Merkmale WGebäude'!$AB7+(1000*'Schadensrel. Merkmale WGebäude'!$AD7*SQRT(BH7)),IF(AZ7<=('Schadensrel. Merkmale WGebäude'!$P7+IF(('Schadensrel. Merkmale WGebäude'!$L7+'Schadensrel. Merkmale WGebäude'!$M7)=0,Berechnungsgrundlagen!$B$20+Berechnungsgrundlagen!$B$21,'Schadensrel. Merkmale WGebäude'!$L7+'Schadensrel. Merkmale WGebäude'!$M7)),0,('Schadensrel. Merkmale WGebäude'!$AB7+(1000*'Schadensrel. Merkmale WGebäude'!$AD7*SQRT(BG7)))))","v":0},{"$f":"IF(AZ7=0,0,'Schadensrel. Merkmale WGebäude'!$AE7)","v":0},null,{"$f":"SUM((BC7+BF7+BI7+BJ7)*(IF(AY7=0,1,AY7)*(IF($AY$5>50,1,IF(BK7=0,1,1-BK7)))))","v":0},{"$f":"MAX(BL7,BN7)","v":0},null,null,null,{"$f":"IF(BP7=0,0,IF(('Schadensrel. Merkmale WGebäude'!$J7+'Schadensrel. Merkmale WGebäude'!$K7)=0,(IF((Berechnungsgrundlagen!$B$18+Berechnungsgrundlagen!$B$19-'Schadensrel. Merkmale WGebäude'!$P7+BP7)>(Berechnungsgrundlagen!$B$18+Berechnungsgrundlagen!$B$19),(Berechnungsgrundlagen!$B$18+Berechnungsgrundlagen!$B$19),(Berechnungsgrundlagen!$B$18+Berechnungsgrundlagen!$B$19-'Schadensrel. Merkmale WGebäude'!$P7+BP7))),(IF(('Schadensrel. Merkmale WGebäude'!$J7+'Schadensrel. Merkmale WGebäude'!$K7-'Schadensrel. Merkmale WGebäude'!$P7+BP7)>('Schadensrel. Merkmale WGebäude'!$J7+'Schadensrel. Merkmale WGebäude'!$K7),('Schadensrel. Merkmale WGebäude'!$J7+'Schadensrel. Merkmale WGebäude'!$K7),('Schadensrel. Merkmale WGebäude'!$J7+'Schadensrel. Merkmale WGebäude'!$K7-'Schadensrel. Merkmale WGebäude'!$P7+BP7)))))","v":0},null,{"$f":"IF('Schadensrel. Merkmale WGebäude'!$I7=Berechnungsgrundlagen!$D$17,IF(BR7>0,'Schadensrel. Merkmale WGebäude'!$T7+(1000*'Schadensrel. Merkmale WGebäude'!$V7*SQRT(BR7)),IF(BQ7=0,0,IF('Schadensrel. Merkmale WGebäude'!$Q7=Berechnungsgrundlagen!$D$18,'Schadensrel. Merkmale WGebäude'!$T7+(1000*'Schadensrel. Merkmale WGebäude'!$V7*SQRT(BQ7)),IF(BP7<='Schadensrel. Merkmale WGebäude'!$P7,0,'Schadensrel. Merkmale WGebäude'!$T7+(1000*'Schadensrel. Merkmale WGebäude'!$V7*SQRT(BQ7)))))),0)","v":0},{"$f":"IF(BP7=0,0,IF((BP7-'Schadensrel. Merkmale WGebäude'!$P7)<=0,0,IF(((BP7-'Schadensrel. Merkmale WGebäude'!$P7))>(IF(('Schadensrel. Merkmale WGebäude'!$L7+'Schadensrel. Merkmale WGebäude'!$M7)=0,(Berechnungsgrundlagen!$B$20+Berechnungsgrundlagen!$B$21),('Schadensrel. Merkmale WGebäude'!$L7+'Schadensrel. Merkmale WGebäude'!$M7))),IF(('Schadensrel. Merkmale WGebäude'!$L7+'Schadensrel. Merkmale WGebäude'!$M7)=0,(Berechnungsgrundlagen!$B$20+Berechnungsgrundlagen!$B$21),('Schadensrel. Merkmale WGebäude'!$L7+'Schadensrel. Merkmale WGebäude'!$M7)),((BP7-'Schadensrel. Merkmale WGebäude'!$P7)))))","v":0},null,{"$f":"IF(BU7>0,'Schadensrel. Merkmale WGebäude'!$X7+(1000*'Schadensrel. Merkmale WGebäude'!$Z7*SQRT(BU7)),IF(BT7=0,0,IF(BP7<='Schadensrel. Merkmale WGebäude'!$P7,0,'Schadensrel. Merkmale WGebäude'!$X7+(1000*'Schadensrel. Merkmale WGebäude'!$Z7*SQRT(BT7)))))","v":0},{"$f":"IF(BP7=0,0,BP7-('Schadensrel. Merkmale WGebäude'!$P7+IF(('Schadensrel. Merkmale WGebäude'!$L7+'Schadensrel. Merkmale WGebäude'!$M7)=0,Berechnungsgrundlagen!$B$20+Berechnungsgrundlagen!$B$21,'Schadensrel. Merkmale WGebäude'!$L7+'Schadensrel. Merkmale WGebäude'!$M7)))","v":0},null,{"$f":"IF(BX7>0,'Schadensrel. Merkmale WGebäude'!$AB7+(1000*'Schadensrel. Merkmale WGebäude'!$AD7*SQRT(BX7)),IF(BP7<=('Schadensrel. Merkmale WGebäude'!$P7+IF(('Schadensrel. Merkmale WGebäude'!$L7+'Schadensrel. Merkmale WGebäude'!$M7)=0,Berechnungsgrundlagen!$B$20+Berechnungsgrundlagen!$B$21,'Schadensrel. Merkmale WGebäude'!$L7+'Schadensrel. Merkmale WGebäude'!$M7)),0,('Schadensrel. Merkmale WGebäude'!$AB7+(1000*'Schadensrel. Merkmale WGebäude'!$AD7*SQRT(BW7)))))","v":0},{"$f":"IF(BP7=0,0,'Schadensrel. Merkmale WGebäude'!$AE7)","v":0},null,{"$f":"SUM((BS7+BV7+BY7+BZ7)*(IF(BO7=0,1,BO7)*(IF($BO$5>50,1,IF(CA7=0,1,1-CA7)))))","v":0},{"$f":"MAX(CB7,CD7)","v":0},null,null,null,{"$f":"IF(CF7=0,0,IF(('Schadensrel. Merkmale WGebäude'!$J7+'Schadensrel. Merkmale WGebäude'!$K7)=0,(IF((Berechnungsgrundlagen!$B$18+Berechnungsgrundlagen!$B$19-'Schadensrel. Merkmale WGebäude'!$P7+CF7)>(Berechnungsgrundlagen!$B$18+Berechnungsgrundlagen!$B$19),(Berechnungsgrundlagen!$B$18+Berechnungsgrundlagen!$B$19),(Berechnungsgrundlagen!$B$18+Berechnungsgrundlagen!$B$19-'Schadensrel. Merkmale WGebäude'!$P7+CF7))),(IF(('Schadensrel. Merkmale WGebäude'!$J7+'Schadensrel. Merkmale WGebäude'!$K7-'Schadensrel. Merkmale WGebäude'!$P7+CF7)>('Schadensrel. Merkmale WGebäude'!$J7+'Schadensrel. Merkmale WGebäude'!$K7),('Schadensrel. Merkmale WGebäude'!$J7+'Schadensrel. Merkmale WGebäude'!$K7),('Schadensrel. Merkmale WGebäude'!$J7+'Schadensrel. Merkmale WGebäude'!$K7-'Schadensrel. Merkmale WGebäude'!$P7+CF7)))))","v":0},null,{"$f":"IF('Schadensrel. Merkmale WGebäude'!$I7=Berechnungsgrundlagen!$D$17,IF(CH7>0,'Schadensrel. Merkmale WGebäude'!$T7+(1000*'Schadensrel. Merkmale WGebäude'!$V7*SQRT(CH7)),IF(CG7=0,0,IF('Schadensrel. Merkmale WGebäude'!$Q7=Berechnungsgrundlagen!$D$18,'Schadensrel. Merkmale WGebäude'!$T7+(1000*'Schadensrel. Merkmale WGebäude'!$V7*SQRT(CG7)),IF(CF7<='Schadensrel. Merkmale WGebäude'!$P7,0,'Schadensrel. Merkmale WGebäude'!$T7+(1000*'Schadensrel. Merkmale WGebäude'!$V7*SQRT(CG7)))))),0)","v":0},{"$f":"IF(CF7=0,0,IF((CF7-'Schadensrel. Merkmale WGebäude'!$P7)<=0,0,IF(((CF7-'Schadensrel. Merkmale WGebäude'!$P7))>(IF(('Schadensrel. Merkmale WGebäude'!$L7+'Schadensrel. Merkmale WGebäude'!$M7)=0,(Berechnungsgrundlagen!$B$20+Berechnungsgrundlagen!$B$21),('Schadensrel. Merkmale WGebäude'!$L7+'Schadensrel. Merkmale WGebäude'!$M7))),IF(('Schadensrel. Merkmale WGebäude'!$L7+'Schadensrel. Merkmale WGebäude'!$M7)=0,(Berechnungsgrundlagen!$B$20+Berechnungsgrundlagen!$B$21),('Schadensrel. Merkmale WGebäude'!$L7+'Schadensrel. Merkmale WGebäude'!$M7)),((CF7-'Schadensrel. Merkmale WGebäude'!$P7)))))","v":0},null,{"$f":"IF(CK7>0,'Schadensrel. Merkmale WGebäude'!$X7+(1000*'Schadensrel. Merkmale WGebäude'!$Z7*SQRT(CK7)),IF(CJ7=0,0,IF(CF7<='Schadensrel. Merkmale WGebäude'!$P7,0,'Schadensrel. Merkmale WGebäude'!$X7+(1000*'Schadensrel. Merkmale WGebäude'!$Z7*SQRT(CJ7)))))","v":0},{"$f":"IF(CF7=0,0,CF7-('Schadensrel. Merkmale WGebäude'!$P7+IF(('Schadensrel. Merkmale WGebäude'!$L7+'Schadensrel. Merkmale WGebäude'!$M7)=0,Berechnungsgrundlagen!$B$20+Berechnungsgrundlagen!$B$21,'Schadensrel. Merkmale WGebäude'!$L7+'Schadensrel. Merkmale WGebäude'!$M7)))","v":0},null,{"$f":"IF(CN7>0,'Schadensrel. Merkmale WGebäude'!$AB7+(1000*'Schadensrel. Merkmale WGebäude'!$AD7*SQRT(CN7)),IF(CF7<=('Schadensrel. Merkmale WGebäude'!$P7+IF(('Schadensrel. Merkmale WGebäude'!$L7+'Schadensrel. Merkmale WGebäude'!$M7)=0,Berechnungsgrundlagen!$B$20+Berechnungsgrundlagen!$B$21,'Schadensrel. Merkmale WGebäude'!$L7+'Schadensrel. Merkmale WGebäude'!$M7)),0,('Schadensrel. Merkmale WGebäude'!$AB7+(1000*'Schadensrel. Merkmale WGebäude'!$AD7*SQRT(CM7)))))","v":0},{"$f":"IF(CF7=0,0,'Schadensrel. Merkmale WGebäude'!$AE7)","v":0},null,{"$f":"SUM((CI7+CL7+CO7+CP7)*(IF(CE7=0,1,CE7)*(IF($CE$5>50,1,IF(CQ7=0,1,1-CQ7)))))","v":0},{"$f":"MAX(CR7,CT7)","v":0},null,null,null,{"$f":"IF(CV7=0,0,IF(('Schadensrel. Merkmale WGebäude'!$J7+'Schadensrel. Merkmale WGebäude'!$K7)=0,(IF((Berechnungsgrundlagen!$B$18+Berechnungsgrundlagen!$B$19-'Schadensrel. Merkmale WGebäude'!$P7+CV7)>(Berechnungsgrundlagen!$B$18+Berechnungsgrundlagen!$B$19),(Berechnungsgrundlagen!$B$18+Berechnungsgrundlagen!$B$19),(Berechnungsgrundlagen!$B$18+Berechnungsgrundlagen!$B$19-'Schadensrel. Merkmale WGebäude'!$P7+CV7))),(IF(('Schadensrel. Merkmale WGebäude'!$J7+'Schadensrel. Merkmale WGebäude'!$K7-'Schadensrel. Merkmale WGebäude'!$P7+CV7)>('Schadensrel. Merkmale WGebäude'!$J7+'Schadensrel. Merkmale WGebäude'!$K7),('Schadensrel. Merkmale WGebäude'!$J7+'Schadensrel. Merkmale WGebäude'!$K7),('Schadensrel. Merkmale WGebäude'!$J7+'Schadensrel. Merkmale WGebäude'!$K7-'Schadensrel. Merkmale WGebäude'!$P7+CV7)))))","v":0},null,{"$f":"IF('Schadensrel. Merkmale WGebäude'!$I7=Berechnungsgrundlagen!$D$17,IF(CX7>0,'Schadensrel. Merkmale WGebäude'!$T7+(1000*'Schadensrel. Merkmale WGebäude'!$V7*SQRT(CX7)),IF(CW7=0,0,IF('Schadensrel. Merkmale WGebäude'!$Q7=Berechnungsgrundlagen!$D$18,'Schadensrel. Merkmale WGebäude'!$T7+(1000*'Schadensrel. Merkmale WGebäude'!$V7*SQRT(CW7)),IF(CV7<='Schadensrel. Merkmale WGebäude'!$P7,0,'Schadensrel. Merkmale WGebäude'!$T7+(1000*'Schadensrel. Merkmale WGebäude'!$V7*SQRT(CW7)))))),0)","v":0},{"$f":"IF(CV7=0,0,IF((CV7-'Schadensrel. Merkmale WGebäude'!$P7)<=0,0,IF(((CV7-'Schadensrel. Merkmale WGebäude'!$P7))>(IF(('Schadensrel. Merkmale WGebäude'!$L7+'Schadensrel. Merkmale WGebäude'!$M7)=0,(Berechnungsgrundlagen!$B$20+Berechnungsgrundlagen!$B$21),('Schadensrel. Merkmale WGebäude'!$L7+'Schadensrel. Merkmale WGebäude'!$M7))),IF(('Schadensrel. Merkmale WGebäude'!$L7+'Schadensrel. Merkmale WGebäude'!$M7)=0,(Berechnungsgrundlagen!$B$20+Berechnungsgrundlagen!$B$21),('Schadensrel. Merkmale WGebäude'!$L7+'Schadensrel. Merkmale WGebäude'!$M7)),((CV7-'Schadensrel. Merkmale WGebäude'!$P7)))))","v":0},null,{"$f":"IF(DA7>0,'Schadensrel. Merkmale WGebäude'!$X7+(1000*'Schadensrel. Merkmale WGebäude'!$Z7*SQRT(DA7)),IF(CZ7=0,0,IF(CV7<='Schadensrel. Merkmale WGebäude'!$P7,0,'Schadensrel. Merkmale WGebäude'!$X7+(1000*'Schadensrel. Merkmale WGebäude'!$Z7*SQRT(CZ7)))))","v":0},{"$f":"IF(CV7=0,0,CV7-('Schadensrel. Merkmale WGebäude'!$P7+IF(('Schadensrel. Merkmale WGebäude'!$L7+'Schadensrel. Merkmale WGebäude'!$M7)=0,Berechnungsgrundlagen!$B$20+Berechnungsgrundlagen!$B$21,'Schadensrel. Merkmale WGebäude'!$L7+'Schadensrel. Merkmale WGebäude'!$M7)))","v":0},null,{"$f":"IF(DD7>0,'Schadensrel. Merkmale WGebäude'!$AB7+(1000*'Schadensrel. Merkmale WGebäude'!$AD7*SQRT(DD7)),IF(CV7<=('Schadensrel. Merkmale WGebäude'!$P7+IF(('Schadensrel. Merkmale WGebäude'!$L7+'Schadensrel. Merkmale WGebäude'!$M7)=0,Berechnungsgrundlagen!$B$20+Berechnungsgrundlagen!$B$21,'Schadensrel. Merkmale WGebäude'!$L7+'Schadensrel. Merkmale WGebäude'!$M7)),0,('Schadensrel. Merkmale WGebäude'!$AB7+(1000*'Schadensrel. Merkmale WGebäude'!$AD7*SQRT(DC7)))))","v":0},{"$f":"IF(CV7=0,0,'Schadensrel. Merkmale WGebäude'!$AE7)","v":0},null,{"$f":"SUM((CY7+DB7+DE7+DF7)*(IF(CU7=0,1,CU7)*(IF($CU$5>50,1,IF(DG7=0,1,1-DG7)))))","v":0},{"$f":"MAX(DH7,DJ7)","v":0}]
[{"$f":"IF('Schadensrel. Merkmale WGebäude'!A8=\"\",\"\",'Schadensrel. Merkmale WGebäude'!A8)","v":""},{"$f":"IF('Schadensrel. Merkmale WGebäude'!B8=\"\",\"\",'Schadensrel. Merkmale WGebäude'!B8)","v":"Sonst."},null,null,{"$f":"IF(D8=0,0,IF(('Schadensrel. Merkmale WGebäude'!$J8+'Schadensrel. Merkmale WGebäude'!$K8)=0,(IF((Berechnungsgrundlagen!$B$18+Berechnungsgrundlagen!$B$19-'Schadensrel. Merkmale WGebäude'!$P8+D8)>(Berechnungsgrundlagen!$B$18+Berechnungsgrundlagen!$B$19),(Berechnungsgrundlagen!$B$18+Berechnungsgrundlagen!$B$19),(Berechnungsgrundlagen!$B$18+Berechnungsgrundlagen!$B$19-'Schadensrel. Merkmale WGebäude'!$P8+D8))),(IF(('Schadensrel. Merkmale WGebäude'!$J8+'Schadensrel. Merkmale WGebäude'!$K8-'Schadensrel. Merkmale WGebäude'!$P8+D8)>('Schadensrel. Merkmale WGebäude'!$J8+'Schadensrel. Merkmale WGebäude'!$K8),('Schadensrel. Merkmale WGebäude'!$J8+'Schadensrel. Merkmale WGebäude'!$K8),('Schadensrel. Merkmale WGebäude'!$J8+'Schadensrel. Merkmale WGebäude'!$K8-'Schadensrel. Merkmale WGebäude'!$P8+D8)))))","v":0},null,{"$f":"IF('Schadensrel. Merkmale WGebäude'!$I8=Berechnungsgrundlagen!$D$17, IF(F8>0,'Schadensrel. Merkmale WGebäude'!$T8+(1000*'Schadensrel. Merkmale WGebäude'!$V8*SQRT(F8)),IF(E8=0,0,IF('Schadensrel. Merkmale WGebäude'!$Q8=Berechnungsgrundlagen!$D$18,'Schadensrel. Merkmale WGebäude'!$T8+(1000*'Schadensrel. Merkmale WGebäude'!$V8*SQRT(E8)),IF(D8<='Schadensrel. Merkmale WGebäude'!$P8,0,'Schadensrel. Merkmale WGebäude'!$T8+(1000*'Schadensrel. Merkmale WGebäude'!$V8*SQRT(E8)))))),0)","v":0},{"$f":"IF(D8=0,0,IF((D8-'Schadensrel. Merkmale WGebäude'!$P8)<=0,0,IF(((D8-'Schadensrel. Merkmale WGebäude'!$P8))>(IF(('Schadensrel. Merkmale WGebäude'!$L8+'Schadensrel. Merkmale WGebäude'!$M8)=0,(Berechnungsgrundlagen!$B$20+Berechnungsgrundlagen!$B$21),('Schadensrel. Merkmale WGebäude'!$L8+'Schadensrel. Merkmale WGebäude'!$M8))),IF(('Schadensrel. Merkmale WGebäude'!$L8+'Schadensrel. Merkmale WGebäude'!$M8)=0,(Berechnungsgrundlagen!$B$20+Berechnungsgrundlagen!$B$21),('Schadensrel. Merkmale WGebäude'!$L8+'Schadensrel. Merkmale WGebäude'!$M8)),((D8-'Schadensrel. Merkmale WGebäude'!$P8)))))","v":0},null,{"$f":"IF(I8>0,'Schadensrel. Merkmale WGebäude'!$X8+(1000*'Schadensrel. Merkmale WGebäude'!$Z8*SQRT(I8)),IF(H8=0,0,IF(D8<='Schadensrel. Merkmale WGebäude'!$P8,0,'Schadensrel. Merkmale WGebäude'!$X8+(1000*'Schadensrel. Merkmale WGebäude'!$Z8*SQRT(H8)))))","v":0},{"$f":"IF(D8=0,0,D8-('Schadensrel. Merkmale WGebäude'!$P8+IF(('Schadensrel. Merkmale WGebäude'!$L8+'Schadensrel. Merkmale WGebäude'!$M8)=0,Berechnungsgrundlagen!$B$20+Berechnungsgrundlagen!$B$21,'Schadensrel. Merkmale WGebäude'!$L8+'Schadensrel. Merkmale WGebäude'!$M8)))","v":0},null,{"$f":"IF(L8>0,'Schadensrel. Merkmale WGebäude'!$AB8+(1000*'Schadensrel. Merkmale WGebäude'!$AD8*SQRT(L8)),IF(D8<=('Schadensrel. Merkmale WGebäude'!$P8+IF(('Schadensrel. Merkmale WGebäude'!$L8+'Schadensrel. Merkmale WGebäude'!$M8)=0,Berechnungsgrundlagen!$B$20+Berechnungsgrundlagen!$B$21,'Schadensrel. Merkmale WGebäude'!$L8+'Schadensrel. Merkmale WGebäude'!$M8)),0,('Schadensrel. Merkmale WGebäude'!$AB8+(1000*'Schadensrel. Merkmale WGebäude'!$AD8*SQRT(K8)))))","v":0},{"$f":"IF(D8=0,0,'Schadensrel. Merkmale WGebäude'!$AE8)","v":0},null,{"$f":"SUM((G8+J8+M8+N8)*(IF(C8=0,1,C8)*(IF($C$5>50,1,IF(O8=0,1,1-O8)))))","v":0},{"$f":"MAX(P8,R8)","v":0},null,null,null,{"$f":"IF(T8=0,0,IF(('Schadensrel. Merkmale WGebäude'!$J8+'Schadensrel. Merkmale WGebäude'!$K8)=0,(IF((Berechnungsgrundlagen!$B$18+Berechnungsgrundlagen!$B$19-'Schadensrel. Merkmale WGebäude'!$P8+T8)>(Berechnungsgrundlagen!$B$18+Berechnungsgrundlagen!$B$19),(Berechnungsgrundlagen!$B$18+Berechnungsgrundlagen!$B$19),(Berechnungsgrundlagen!$B$18+Berechnungsgrundlagen!$B$19-'Schadensrel. Merkmale WGebäude'!$P8+T8))),(IF(('Schadensrel. Merkmale WGebäude'!$J8+'Schadensrel. Merkmale WGebäude'!$K8-'Schadensrel. Merkmale WGebäude'!$P8+T8)>('Schadensrel. Merkmale WGebäude'!$J8+'Schadensrel. Merkmale WGebäude'!$K8),('Schadensrel. Merkmale WGebäude'!$J8+'Schadensrel. Merkmale WGebäude'!$K8),('Schadensrel. Merkmale WGebäude'!$J8+'Schadensrel. Merkmale WGebäude'!$K8-'Schadensrel. Merkmale WGebäude'!$P8+T8)))))","v":0},null,{"$f":"IF('Schadensrel. Merkmale WGebäude'!$I8=Berechnungsgrundlagen!$D$17, IF(V8>0,'Schadensrel. Merkmale WGebäude'!$T8+(1000*'Schadensrel. Merkmale WGebäude'!$V8*SQRT(V8)),IF(U8=0,0,IF('Schadensrel. Merkmale WGebäude'!$Q8=Berechnungsgrundlagen!$D$18,'Schadensrel. Merkmale WGebäude'!$T8+(1000*'Schadensrel. Merkmale WGebäude'!$V8*SQRT(U8)),IF(T8<='Schadensrel. Merkmale WGebäude'!$P8,0,'Schadensrel. Merkmale WGebäude'!$T8+(1000*'Schadensrel. Merkmale WGebäude'!$V8*SQRT(U8)))))),0)","v":0},{"$f":"IF(T8=0,0,IF((T8-'Schadensrel. Merkmale WGebäude'!$P8)<=0,0,IF(((T8-'Schadensrel. Merkmale WGebäude'!$P8))>(IF(('Schadensrel. Merkmale WGebäude'!$L8+'Schadensrel. Merkmale WGebäude'!$M8)=0,(Berechnungsgrundlagen!$B$20+Berechnungsgrundlagen!$B$21),('Schadensrel. Merkmale WGebäude'!$L8+'Schadensrel. Merkmale WGebäude'!$M8))),IF(('Schadensrel. Merkmale WGebäude'!$L8+'Schadensrel. Merkmale WGebäude'!$M8)=0,(Berechnungsgrundlagen!$B$20+Berechnungsgrundlagen!$B$21),('Schadensrel. Merkmale WGebäude'!$L8+'Schadensrel. Merkmale WGebäude'!$M8)),((T8-'Schadensrel. Merkmale WGebäude'!$P8)))))","v":0},null,{"$f":"IF(Y8>0,'Schadensrel. Merkmale WGebäude'!$X8+(1000*'Schadensrel. Merkmale WGebäude'!$Z8*SQRT(Y8)),IF(X8=0,0,IF(T8<='Schadensrel. Merkmale WGebäude'!$P8,0,'Schadensrel. Merkmale WGebäude'!$X8+(1000*'Schadensrel. Merkmale WGebäude'!$Z8*SQRT(X8)))))","v":0},{"$f":"IF(T8=0,0,T8-('Schadensrel. Merkmale WGebäude'!$P8+IF(('Schadensrel. Merkmale WGebäude'!$L8+'Schadensrel. Merkmale WGebäude'!$M8)=0,Berechnungsgrundlagen!$B$20+Berechnungsgrundlagen!$B$21,'Schadensrel. Merkmale WGebäude'!$L8+'Schadensrel. Merkmale WGebäude'!$M8)))","v":0},null,{"$f":"IF(AB8>0,'Schadensrel. Merkmale WGebäude'!$AB8+(1000*'Schadensrel. Merkmale WGebäude'!$AD8*SQRT(AB8)),IF(T8<=('Schadensrel. Merkmale WGebäude'!$P8+IF(('Schadensrel. Merkmale WGebäude'!$L8+'Schadensrel. Merkmale WGebäude'!$M8)=0,Berechnungsgrundlagen!$B$20+Berechnungsgrundlagen!$B$21,'Schadensrel. Merkmale WGebäude'!$L8+'Schadensrel. Merkmale WGebäude'!$M8)),0,('Schadensrel. Merkmale WGebäude'!$AB8+(1000*'Schadensrel. Merkmale WGebäude'!$AD8*SQRT(AA8)))))","v":0},{"$f":"IF(T8=0,0,'Schadensrel. Merkmale WGebäude'!$AE8)","v":0},null,{"$f":"SUM((W8+Z8+AC8+AD8)*(IF(S8=0,1,S8)*(IF($S$5>50,1,IF(AE8=0,1,(1-AE8))))))","v":0},{"$f":"MAX(AF8,AH8)","v":0},null,null,null,{"$f":"IF(AJ8=0,0,IF(('Schadensrel. Merkmale WGebäude'!$J8+'Schadensrel. Merkmale WGebäude'!$K8)=0,(IF((Berechnungsgrundlagen!$B$18+Berechnungsgrundlagen!$B$19-'Schadensrel. Merkmale WGebäude'!$P8+AJ8)>(Berechnungsgrundlagen!$B$18+Berechnungsgrundlagen!$B$19),(Berechnungsgrundlagen!$B$18+Berechnungsgrundlagen!$B$19),(Berechnungsgrundlagen!$B$18+Berechnungsgrundlagen!$B$19-'Schadensrel. Merkmale WGebäude'!$P8+AJ8))),(IF(('Schadensrel. Merkmale WGebäude'!$J8+'Schadensrel. Merkmale WGebäude'!$K8-'Schadensrel. Merkmale WGebäude'!$P8+AJ8)>('Schadensrel. Merkmale WGebäude'!$J8+'Schadensrel. Merkmale WGebäude'!$K8),('Schadensrel. Merkmale WGebäude'!$J8+'Schadensrel. Merkmale WGebäude'!$K8),('Schadensrel. Merkmale WGebäude'!$J8+'Schadensrel. Merkmale WGebäude'!$K8-'Schadensrel. Merkmale WGebäude'!$P8+AJ8)))))","v":0},null,{"$f":"IF('Schadensrel. Merkmale WGebäude'!$I8=Berechnungsgrundlagen!$D$17,IF(AL8>0,'Schadensrel. Merkmale WGebäude'!$T8+(1000*'Schadensrel. Merkmale WGebäude'!$V8*SQRT(AL8)),IF(AK8=0,0,IF('Schadensrel. Merkmale WGebäude'!$Q8=Berechnungsgrundlagen!$D$18,'Schadensrel. Merkmale WGebäude'!$T8+(1000*'Schadensrel. Merkmale WGebäude'!$V8*SQRT(AK8)),IF(AJ8<='Schadensrel. Merkmale WGebäude'!$P8,0,'Schadensrel. Merkmale WGebäude'!$T8+(1000*'Schadensrel. Merkmale WGebäude'!$V8*SQRT(AK8)))))),0)","v":0},{"$f":"IF(AJ8=0,0,IF((AJ8-'Schadensrel. Merkmale WGebäude'!$P8)<=0,0,IF(((AJ8-'Schadensrel. Merkmale WGebäude'!$P8))>(IF(('Schadensrel. Merkmale WGebäude'!$L8+'Schadensrel. Merkmale WGebäude'!$M8)=0,(Berechnungsgrundlagen!$B$20+Berechnungsgrundlagen!$B$21),('Schadensrel. Merkmale WGebäude'!$L8+'Schadensrel. Merkmale WGebäude'!$M8))),IF(('Schadensrel. Merkmale WGebäude'!$L8+'Schadensrel. Merkmale WGebäude'!$M8)=0,(Berechnungsgrundlagen!$B$20+Berechnungsgrundlagen!$B$21),('Schadensrel. Merkmale WGebäude'!$L8+'Schadensrel. Merkmale WGebäude'!$M8)),((AJ8-'Schadensrel. Merkmale WGebäude'!$P8)))))","v":0},null,{"$f":"IF(AO8>0,'Schadensrel. Merkmale WGebäude'!$X8+(1000*'Schadensrel. Merkmale WGebäude'!$Z8*SQRT(AO8)),IF(AN8=0,0,IF(AJ8<='Schadensrel. Merkmale WGebäude'!$P8,0,'Schadensrel. Merkmale WGebäude'!$X8+(1000*'Schadensrel. Merkmale WGebäude'!$Z8*SQRT(AN8)))))","v":0},{"$f":"IF(AJ8=0,0,AJ8-('Schadensrel. Merkmale WGebäude'!$P8+IF(('Schadensrel. Merkmale WGebäude'!$L8+'Schadensrel. Merkmale WGebäude'!$M8)=0,Berechnungsgrundlagen!$B$20+Berechnungsgrundlagen!$B$21,'Schadensrel. Merkmale WGebäude'!$L8+'Schadensrel. Merkmale WGebäude'!$M8)))","v":0},null,{"$f":"IF(AR8>0,'Schadensrel. Merkmale WGebäude'!$AB8+(1000*'Schadensrel. Merkmale WGebäude'!$AD8*SQRT(AR8)),IF(AJ8<=('Schadensrel. Merkmale WGebäude'!$P8+IF(('Schadensrel. Merkmale WGebäude'!$L8+'Schadensrel. Merkmale WGebäude'!$M8)=0,Berechnungsgrundlagen!$B$20+Berechnungsgrundlagen!$B$21,'Schadensrel. Merkmale WGebäude'!$L8+'Schadensrel. Merkmale WGebäude'!$M8)),0,('Schadensrel. Merkmale WGebäude'!$AB8+(1000*'Schadensrel. Merkmale WGebäude'!$AD8*SQRT(AQ8)))))","v":0},{"$f":"IF(AJ8=0,0,'Schadensrel. Merkmale WGebäude'!$AE8)","v":0},null,{"$f":"SUM((AM8+AP8+AS8+AT8)*(IF(AI8=0,1,AI8)*(IF($AI$5>50,1,IF(AU8=0,1,1-AU8)))))","v":0},{"$f":"MAX(AV8,AX8)","v":0},null,null,null,{"$f":"IF(AZ8=0,0,IF(('Schadensrel. Merkmale WGebäude'!$J8+'Schadensrel. Merkmale WGebäude'!$K8)=0,(IF((Berechnungsgrundlagen!$B$18+Berechnungsgrundlagen!$B$19-'Schadensrel. Merkmale WGebäude'!$P8+AZ8)>(Berechnungsgrundlagen!$B$18+Berechnungsgrundlagen!$B$19),(Berechnungsgrundlagen!$B$18+Berechnungsgrundlagen!$B$19),(Berechnungsgrundlagen!$B$18+Berechnungsgrundlagen!$B$19-'Schadensrel. Merkmale WGebäude'!$P8+AZ8))),(IF(('Schadensrel. Merkmale WGebäude'!$J8+'Schadensrel. Merkmale WGebäude'!$K8-'Schadensrel. Merkmale WGebäude'!$P8+AZ8)>('Schadensrel. Merkmale WGebäude'!$J8+'Schadensrel. Merkmale WGebäude'!$K8),('Schadensrel. Merkmale WGebäude'!$J8+'Schadensrel. Merkmale WGebäude'!$K8),('Schadensrel. Merkmale WGebäude'!$J8+'Schadensrel. Merkmale WGebäude'!$K8-'Schadensrel. Merkmale WGebäude'!$P8+AZ8)))))","v":0},null,{"$f":"IF('Schadensrel. Merkmale WGebäude'!$I8=Berechnungsgrundlagen!$D$17,IF(BB8>0,'Schadensrel. Merkmale WGebäude'!$T8+(1000*'Schadensrel. Merkmale WGebäude'!$V8*SQRT(BB8)),IF(BA8=0,0,IF('Schadensrel. Merkmale WGebäude'!$Q8=Berechnungsgrundlagen!$D$18,'Schadensrel. Merkmale WGebäude'!$T8+(1000*'Schadensrel. Merkmale WGebäude'!$V8*SQRT(BA8)),IF(AZ8<='Schadensrel. Merkmale WGebäude'!$P8,0,'Schadensrel. Merkmale WGebäude'!$T8+(1000*'Schadensrel. Merkmale WGebäude'!$V8*SQRT(BA8)))))),0)","v":0},{"$f":"IF(AZ8=0,0,IF((AZ8-'Schadensrel. Merkmale WGebäude'!$P8)<=0,0,IF(((AZ8-'Schadensrel. Merkmale WGebäude'!$P8))>(IF(('Schadensrel. Merkmale WGebäude'!$L8+'Schadensrel. Merkmale WGebäude'!$M8)=0,(Berechnungsgrundlagen!$B$20+Berechnungsgrundlagen!$B$21),('Schadensrel. Merkmale WGebäude'!$L8+'Schadensrel. Merkmale WGebäude'!$M8))),IF(('Schadensrel. Merkmale WGebäude'!$L8+'Schadensrel. Merkmale WGebäude'!$M8)=0,(Berechnungsgrundlagen!$B$20+Berechnungsgrundlagen!$B$21),('Schadensrel. Merkmale WGebäude'!$L8+'Schadensrel. Merkmale WGebäude'!$M8)),((AZ8-'Schadensrel. Merkmale WGebäude'!$P8)))))","v":0},null,{"$f":"IF(BE8>0,'Schadensrel. Merkmale WGebäude'!$X8+(1000*'Schadensrel. Merkmale WGebäude'!$Z8*SQRT(BE8)),IF(BD8=0,0,IF(AZ8<='Schadensrel. Merkmale WGebäude'!$P8,0,'Schadensrel. Merkmale WGebäude'!$X8+(1000*'Schadensrel. Merkmale WGebäude'!$Z8*SQRT(BD8)))))","v":0},{"$f":"IF(AZ8=0,0,AZ8-('Schadensrel. Merkmale WGebäude'!$P8+IF(('Schadensrel. Merkmale WGebäude'!$L8+'Schadensrel. Merkmale WGebäude'!$M8)=0,Berechnungsgrundlagen!$B$20+Berechnungsgrundlagen!$B$21,'Schadensrel. Merkmale WGebäude'!$L8+'Schadensrel. Merkmale WGebäude'!$M8)))","v":0},null,{"$f":"IF(BH8>0,'Schadensrel. Merkmale WGebäude'!$AB8+(1000*'Schadensrel. Merkmale WGebäude'!$AD8*SQRT(BH8)),IF(AZ8<=('Schadensrel. Merkmale WGebäude'!$P8+IF(('Schadensrel. Merkmale WGebäude'!$L8+'Schadensrel. Merkmale WGebäude'!$M8)=0,Berechnungsgrundlagen!$B$20+Berechnungsgrundlagen!$B$21,'Schadensrel. Merkmale WGebäude'!$L8+'Schadensrel. Merkmale WGebäude'!$M8)),0,('Schadensrel. Merkmale WGebäude'!$AB8+(1000*'Schadensrel. Merkmale WGebäude'!$AD8*SQRT(BG8)))))","v":0},{"$f":"IF(AZ8=0,0,'Schadensrel. Merkmale WGebäude'!$AE8)","v":0},null,{"$f":"SUM((BC8+BF8+BI8+BJ8)*(IF(AY8=0,1,AY8)*(IF($AY$5>50,1,IF(BK8=0,1,1-BK8)))))","v":0},{"$f":"MAX(BL8,BN8)","v":0},null,null,null,{"$f":"IF(BP8=0,0,IF(('Schadensrel. Merkmale WGebäude'!$J8+'Schadensrel. Merkmale WGebäude'!$K8)=0,(IF((Berechnungsgrundlagen!$B$18+Berechnungsgrundlagen!$B$19-'Schadensrel. Merkmale WGebäude'!$P8+BP8)>(Berechnungsgrundlagen!$B$18+Berechnungsgrundlagen!$B$19),(Berechnungsgrundlagen!$B$18+Berechnungsgrundlagen!$B$19),(Berechnungsgrundlagen!$B$18+Berechnungsgrundlagen!$B$19-'Schadensrel. Merkmale WGebäude'!$P8+BP8))),(IF(('Schadensrel. Merkmale WGebäude'!$J8+'Schadensrel. Merkmale WGebäude'!$K8-'Schadensrel. Merkmale WGebäude'!$P8+BP8)>('Schadensrel. Merkmale WGebäude'!$J8+'Schadensrel. Merkmale WGebäude'!$K8),('Schadensrel. Merkmale WGebäude'!$J8+'Schadensrel. Merkmale WGebäude'!$K8),('Schadensrel. Merkmale WGebäude'!$J8+'Schadensrel. Merkmale WGebäude'!$K8-'Schadensrel. Merkmale WGebäude'!$P8+BP8)))))","v":0},null,{"$f":"IF('Schadensrel. Merkmale WGebäude'!$I8=Berechnungsgrundlagen!$D$17,IF(BR8>0,'Schadensrel. Merkmale WGebäude'!$T8+(1000*'Schadensrel. Merkmale WGebäude'!$V8*SQRT(BR8)),IF(BQ8=0,0,IF('Schadensrel. Merkmale WGebäude'!$Q8=Berechnungsgrundlagen!$D$18,'Schadensrel. Merkmale WGebäude'!$T8+(1000*'Schadensrel. Merkmale WGebäude'!$V8*SQRT(BQ8)),IF(BP8<='Schadensrel. Merkmale WGebäude'!$P8,0,'Schadensrel. Merkmale WGebäude'!$T8+(1000*'Schadensrel. Merkmale WGebäude'!$V8*SQRT(BQ8)))))),0)","v":0},{"$f":"IF(BP8=0,0,IF((BP8-'Schadensrel. Merkmale WGebäude'!$P8)<=0,0,IF(((BP8-'Schadensrel. Merkmale WGebäude'!$P8))>(IF(('Schadensrel. Merkmale WGebäude'!$L8+'Schadensrel. Merkmale WGebäude'!$M8)=0,(Berechnungsgrundlagen!$B$20+Berechnungsgrundlagen!$B$21),('Schadensrel. Merkmale WGebäude'!$L8+'Schadensrel. Merkmale WGebäude'!$M8))),IF(('Schadensrel. Merkmale WGebäude'!$L8+'Schadensrel. Merkmale WGebäude'!$M8)=0,(Berechnungsgrundlagen!$B$20+Berechnungsgrundlagen!$B$21),('Schadensrel. Merkmale WGebäude'!$L8+'Schadensrel. Merkmale WGebäude'!$M8)),((BP8-'Schadensrel. Merkmale WGebäude'!$P8)))))","v":0},null,{"$f":"IF(BU8>0,'Schadensrel. Merkmale WGebäude'!$X8+(1000*'Schadensrel. Merkmale WGebäude'!$Z8*SQRT(BU8)),IF(BT8=0,0,IF(BP8<='Schadensrel. Merkmale WGebäude'!$P8,0,'Schadensrel. Merkmale WGebäude'!$X8+(1000*'Schadensrel. Merkmale WGebäude'!$Z8*SQRT(BT8)))))","v":0},{"$f":"IF(BP8=0,0,BP8-('Schadensrel. Merkmale WGebäude'!$P8+IF(('Schadensrel. Merkmale WGebäude'!$L8+'Schadensrel. Merkmale WGebäude'!$M8)=0,Berechnungsgrundlagen!$B$20+Berechnungsgrundlagen!$B$21,'Schadensrel. Merkmale WGebäude'!$L8+'Schadensrel. Merkmale WGebäude'!$M8)))","v":0},null,{"$f":"IF(BX8>0,'Schadensrel. Merkmale WGebäude'!$AB8+(1000*'Schadensrel. Merkmale WGebäude'!$AD8*SQRT(BX8)),IF(BP8<=('Schadensrel. Merkmale WGebäude'!$P8+IF(('Schadensrel. Merkmale WGebäude'!$L8+'Schadensrel. Merkmale WGebäude'!$M8)=0,Berechnungsgrundlagen!$B$20+Berechnungsgrundlagen!$B$21,'Schadensrel. Merkmale WGebäude'!$L8+'Schadensrel. Merkmale WGebäude'!$M8)),0,('Schadensrel. Merkmale WGebäude'!$AB8+(1000*'Schadensrel. Merkmale WGebäude'!$AD8*SQRT(BW8)))))","v":0},{"$f":"IF(BP8=0,0,'Schadensrel. Merkmale WGebäude'!$AE8)","v":0},null,{"$f":"SUM((BS8+BV8+BY8+BZ8)*(IF(BO8=0,1,BO8)*(IF($BO$5>50,1,IF(CA8=0,1,1-CA8)))))","v":0},{"$f":"MAX(CB8,CD8)","v":0},null,null,null,{"$f":"IF(CF8=0,0,IF(('Schadensrel. Merkmale WGebäude'!$J8+'Schadensrel. Merkmale WGebäude'!$K8)=0,(IF((Berechnungsgrundlagen!$B$18+Berechnungsgrundlagen!$B$19-'Schadensrel. Merkmale WGebäude'!$P8+CF8)>(Berechnungsgrundlagen!$B$18+Berechnungsgrundlagen!$B$19),(Berechnungsgrundlagen!$B$18+Berechnungsgrundlagen!$B$19),(Berechnungsgrundlagen!$B$18+Berechnungsgrundlagen!$B$19-'Schadensrel. Merkmale WGebäude'!$P8+CF8))),(IF(('Schadensrel. Merkmale WGebäude'!$J8+'Schadensrel. Merkmale WGebäude'!$K8-'Schadensrel. Merkmale WGebäude'!$P8+CF8)>('Schadensrel. Merkmale WGebäude'!$J8+'Schadensrel. Merkmale WGebäude'!$K8),('Schadensrel. Merkmale WGebäude'!$J8+'Schadensrel. Merkmale WGebäude'!$K8),('Schadensrel. Merkmale WGebäude'!$J8+'Schadensrel. Merkmale WGebäude'!$K8-'Schadensrel. Merkmale WGebäude'!$P8+CF8)))))","v":0},null,{"$f":"IF('Schadensrel. Merkmale WGebäude'!$I8=Berechnungsgrundlagen!$D$17,IF(CH8>0,'Schadensrel. Merkmale WGebäude'!$T8+(1000*'Schadensrel. Merkmale WGebäude'!$V8*SQRT(CH8)),IF(CG8=0,0,IF('Schadensrel. Merkmale WGebäude'!$Q8=Berechnungsgrundlagen!$D$18,'Schadensrel. Merkmale WGebäude'!$T8+(1000*'Schadensrel. Merkmale WGebäude'!$V8*SQRT(CG8)),IF(CF8<='Schadensrel. Merkmale WGebäude'!$P8,0,'Schadensrel. Merkmale WGebäude'!$T8+(1000*'Schadensrel. Merkmale WGebäude'!$V8*SQRT(CG8)))))),0)","v":0},{"$f":"IF(CF8=0,0,IF((CF8-'Schadensrel. Merkmale WGebäude'!$P8)<=0,0,IF(((CF8-'Schadensrel. Merkmale WGebäude'!$P8))>(IF(('Schadensrel. Merkmale WGebäude'!$L8+'Schadensrel. Merkmale WGebäude'!$M8)=0,(Berechnungsgrundlagen!$B$20+Berechnungsgrundlagen!$B$21),('Schadensrel. Merkmale WGebäude'!$L8+'Schadensrel. Merkmale WGebäude'!$M8))),IF(('Schadensrel. Merkmale WGebäude'!$L8+'Schadensrel. Merkmale WGebäude'!$M8)=0,(Berechnungsgrundlagen!$B$20+Berechnungsgrundlagen!$B$21),('Schadensrel. Merkmale WGebäude'!$L8+'Schadensrel. Merkmale WGebäude'!$M8)),((CF8-'Schadensrel. Merkmale WGebäude'!$P8)))))","v":0},null,{"$f":"IF(CK8>0,'Schadensrel. Merkmale WGebäude'!$X8+(1000*'Schadensrel. Merkmale WGebäude'!$Z8*SQRT(CK8)),IF(CJ8=0,0,IF(CF8<='Schadensrel. Merkmale WGebäude'!$P8,0,'Schadensrel. Merkmale WGebäude'!$X8+(1000*'Schadensrel. Merkmale WGebäude'!$Z8*SQRT(CJ8)))))","v":0},{"$f":"IF(CF8=0,0,CF8-('Schadensrel. Merkmale WGebäude'!$P8+IF(('Schadensrel. Merkmale WGebäude'!$L8+'Schadensrel. Merkmale WGebäude'!$M8)=0,Berechnungsgrundlagen!$B$20+Berechnungsgrundlagen!$B$21,'Schadensrel. Merkmale WGebäude'!$L8+'Schadensrel. Merkmale WGebäude'!$M8)))","v":0},null,{"$f":"IF(CN8>0,'Schadensrel. Merkmale WGebäude'!$AB8+(1000*'Schadensrel. Merkmale WGebäude'!$AD8*SQRT(CN8)),IF(CF8<=('Schadensrel. Merkmale WGebäude'!$P8+IF(('Schadensrel. Merkmale WGebäude'!$L8+'Schadensrel. Merkmale WGebäude'!$M8)=0,Berechnungsgrundlagen!$B$20+Berechnungsgrundlagen!$B$21,'Schadensrel. Merkmale WGebäude'!$L8+'Schadensrel. Merkmale WGebäude'!$M8)),0,('Schadensrel. Merkmale WGebäude'!$AB8+(1000*'Schadensrel. Merkmale WGebäude'!$AD8*SQRT(CM8)))))","v":0},{"$f":"IF(CF8=0,0,'Schadensrel. Merkmale WGebäude'!$AE8)","v":0},null,{"$f":"SUM((CI8+CL8+CO8+CP8)*(IF(CE8=0,1,CE8)*(IF($CE$5>50,1,IF(CQ8=0,1,1-CQ8)))))","v":0},{"$f":"MAX(CR8,CT8)","v":0},null,null,null,{"$f":"IF(CV8=0,0,IF(('Schadensrel. Merkmale WGebäude'!$J8+'Schadensrel. Merkmale WGebäude'!$K8)=0,(IF((Berechnungsgrundlagen!$B$18+Berechnungsgrundlagen!$B$19-'Schadensrel. Merkmale WGebäude'!$P8+CV8)>(Berechnungsgrundlagen!$B$18+Berechnungsgrundlagen!$B$19),(Berechnungsgrundlagen!$B$18+Berechnungsgrundlagen!$B$19),(Berechnungsgrundlagen!$B$18+Berechnungsgrundlagen!$B$19-'Schadensrel. Merkmale WGebäude'!$P8+CV8))),(IF(('Schadensrel. Merkmale WGebäude'!$J8+'Schadensrel. Merkmale WGebäude'!$K8-'Schadensrel. Merkmale WGebäude'!$P8+CV8)>('Schadensrel. Merkmale WGebäude'!$J8+'Schadensrel. Merkmale WGebäude'!$K8),('Schadensrel. Merkmale WGebäude'!$J8+'Schadensrel. Merkmale WGebäude'!$K8),('Schadensrel. Merkmale WGebäude'!$J8+'Schadensrel. Merkmale WGebäude'!$K8-'Schadensrel. Merkmale WGebäude'!$P8+CV8)))))","v":0},null,{"$f":"IF('Schadensrel. Merkmale WGebäude'!$I8=Berechnungsgrundlagen!$D$17,IF(CX8>0,'Schadensrel. Merkmale WGebäude'!$T8+(1000*'Schadensrel. Merkmale WGebäude'!$V8*SQRT(CX8)),IF(CW8=0,0,IF('Schadensrel. Merkmale WGebäude'!$Q8=Berechnungsgrundlagen!$D$18,'Schadensrel. Merkmale WGebäude'!$T8+(1000*'Schadensrel. Merkmale WGebäude'!$V8*SQRT(CW8)),IF(CV8<='Schadensrel. Merkmale WGebäude'!$P8,0,'Schadensrel. Merkmale WGebäude'!$T8+(1000*'Schadensrel. Merkmale WGebäude'!$V8*SQRT(CW8)))))),0)","v":0},{"$f":"IF(CV8=0,0,IF((CV8-'Schadensrel. Merkmale WGebäude'!$P8)<=0,0,IF(((CV8-'Schadensrel. Merkmale WGebäude'!$P8))>(IF(('Schadensrel. Merkmale WGebäude'!$L8+'Schadensrel. Merkmale WGebäude'!$M8)=0,(Berechnungsgrundlagen!$B$20+Berechnungsgrundlagen!$B$21),('Schadensrel. Merkmale WGebäude'!$L8+'Schadensrel. Merkmale WGebäude'!$M8))),IF(('Schadensrel. Merkmale WGebäude'!$L8+'Schadensrel. Merkmale WGebäude'!$M8)=0,(Berechnungsgrundlagen!$B$20+Berechnungsgrundlagen!$B$21),('Schadensrel. Merkmale WGebäude'!$L8+'Schadensrel. Merkmale WGebäude'!$M8)),((CV8-'Schadensrel. Merkmale WGebäude'!$P8)))))","v":0},null,{"$f":"IF(DA8>0,'Schadensrel. Merkmale WGebäude'!$X8+(1000*'Schadensrel. Merkmale WGebäude'!$Z8*SQRT(DA8)),IF(CZ8=0,0,IF(CV8<='Schadensrel. Merkmale WGebäude'!$P8,0,'Schadensrel. Merkmale WGebäude'!$X8+(1000*'Schadensrel. Merkmale WGebäude'!$Z8*SQRT(CZ8)))))","v":0},{"$f":"IF(CV8=0,0,CV8-('Schadensrel. Merkmale WGebäude'!$P8+IF(('Schadensrel. Merkmale WGebäude'!$L8+'Schadensrel. Merkmale WGebäude'!$M8)=0,Berechnungsgrundlagen!$B$20+Berechnungsgrundlagen!$B$21,'Schadensrel. Merkmale WGebäude'!$L8+'Schadensrel. Merkmale WGebäude'!$M8)))","v":0},null,{"$f":"IF(DD8>0,'Schadensrel. Merkmale WGebäude'!$AB8+(1000*'Schadensrel. Merkmale WGebäude'!$AD8*SQRT(DD8)),IF(CV8<=('Schadensrel. Merkmale WGebäude'!$P8+IF(('Schadensrel. Merkmale WGebäude'!$L8+'Schadensrel. Merkmale WGebäude'!$M8)=0,Berechnungsgrundlagen!$B$20+Berechnungsgrundlagen!$B$21,'Schadensrel. Merkmale WGebäude'!$L8+'Schadensrel. Merkmale WGebäude'!$M8)),0,('Schadensrel. Merkmale WGebäude'!$AB8+(1000*'Schadensrel. Merkmale WGebäude'!$AD8*SQRT(DC8)))))","v":0},{"$f":"IF(CV8=0,0,'Schadensrel. Merkmale WGebäude'!$AE8)","v":0},null,{"$f":"SUM((CY8+DB8+DE8+DF8)*(IF(CU8=0,1,CU8)*(IF($CU$5>50,1,IF(DG8=0,1,1-DG8)))))","v":0},{"$f":"MAX(DH8,DJ8)","v":0}]
[]
["Summe Vermögensschäden"]
["Wohngebäude bei HQx",null,{"$f":"Projektgrunddaten!$C$24","v":0},null,null,null,null,null,null,null,null,null,null,null,null,null,null,null,{"$f":"Projektgrunddaten!$C$25","v":0},null,null,null,null,null,null,null,null,null,null,null,null,null,null,null,{"$f":"Projektgrunddaten!$C$26","v":0},null,null,null,null,null,null,null,null,null,null,null,null,null,null,null,{"$f":"Projektgrunddaten!$C$27","v":0},null,null,null,null,null,null,null,null,null,null,null,null,null,null,null,{"$f":"Projektgrunddaten!$C$28","v":0},null,null,null,null,null,null,null,null,null,null,null,null,null,null,null,{"$f":"Projektgrunddaten!$C$29","v":100},null,null,null,null,null,null,null,null,null,null,null,null,null,null,null,{"$f":"Projektgrunddaten!$C$30","v":0}]
[null,null,{"$f":"SUM(Q7:Q8)","v":0},null,null,null,null,null,null,null,null,null,null,null,null,null,null,null,{"$f":"SUM(AG7:AG8)","v":0},null,null,null,null,null,null,null,null,null,null,null,null,null,null,null,{"$f":"SUM(AW7:AW8)","v":0},null,null,null,null,null,null,null,null,null,null,null,null,null,null,null,{"$f":"SUM(BM7:BM8)","v":0},null,null,null,null,null,null,null,null,null,null,null,null,null,null,null,{"$f":"SUM(CC7:CC8)","v":0},null,null,null,null,null,null,null,null,null,null,null,null,null,null,null,{"$f":"SUM(CS7:CS8)","v":0},null,null,null,null,null,null,null,null,null,null,null,null,null,null,null,{"$f":"SUM(DI7:DI8)","v":0}]
[]
[]
[]
[]
[]
[]
[]
[]
[]
[]
[]
[]
[]
[]
[]
[]
["Anzahl der Wohngebäude","Gebäudetyp"]
["Anzahl EFH","EFH",{"$f":"SUMIFS($C$7:$C$8,$B$7:$B$8,$B30,$Q$7:$Q$8,\">0\")","v":0},null,null,null,null,null,null,null,null,null,null,null,null,null,null,null,{"$f":"SUMIFS($S$7:$S$8,$B$7:$B$8,$B30,$AG$7:$AG$8,\">0\")","v":0},null,null,null,null,null,null,null,null,null,null,null,null,null,null,null,{"$f":"SUMIFS($AI$7:$AI$8,$B$7:$B$8,$B30,$AW$7:$AW$8,\">0\")","v":0},null,null,null,null,null,null,null,null,null,null,null,null,null,null,null,{"$f":"SUMIFS($AY$7:$AY$8,$B$7:$B$8,$B30,$BM$7:$BM$8,\">0\")","v":0},null,null,null,null,null,null,null,null,null,null,null,null,null,null,null,{"$f":"SUMIFS($BO$7:$BO$8,$B$7:$B$8,$B30,$CC$7:$CC$8,\">0\")","v":0},null,null,null,null,null,null,null,null,null,null,null,null,null,null,null,{"$f":"SUMIFS($CE$7:$CE$8,$B$7:$B$8,$B30,$CS$7:$CS$8,\">0\")","v":0},null,null,null,null,null,null,null,null,null,null,null,null,null,null,null,{"$f":"SUMIFS($CU$7:$CU$8,$B$7:$B$8,$B30,$DI$7:$DI$8,\">0\")","v":0}]
["Anzahl MFH","MFH",{"$f":"SUMIFS($C$7:$C$8,$B$7:$B$8,$B31,$Q$7:$Q$8,\">0\")","v":0},null,null,null,null,null,null,null,null,null,null,null,null,null,null,null,{"$f":"SUMIFS($S$7:$S$8,$B$7:$B$8,$B31,$AG$7:$AG$8,\">0\")","v":0},null,null,null,null,null,null,null,null,null,null,null,null,null,null,null,{"$f":"SUMIFS($AI$7:$AI$8,$B$7:$B$8,$B31,$AW$7:$AW$8,\">0\")","v":0},null,null,null,null,null,null,null,null,null,null,null,null,null,null,null,{"$f":"SUMIFS($AY$7:$AY$8,$B$7:$B$8,$B31,$BM$7:$BM$8,\">0\")","v":0},null,null,null,null,null,null,null,null,null,null,null,null,null,null,null,{"$f":"SUMIFS($BO$7:$BO$8,$B$7:$B$8,$B31,$CC$7:$CC$8,\">0\")","v":0},null,null,null,null,null,null,null,null,null,null,null,null,null,null,null,{"$f":"SUMIFS($CE$7:$CE$8,$B$7:$B$8,$B31,$CS$7:$CS$8,\">0\")","v":0},null,null,null,null,null,null,null,null,null,null,null,null,null,null,null,{"$f":"SUMIFS($CU$7:$CU$8,$B$7:$B$8,$B31,$DI$7:$DI$8,\">0\")","v":0}]
["Anzahl RH","RH",{"$f":"SUMIFS($C$7:$C$8,$B$7:$B$8,$B32,$Q$7:$Q$8,\">0\")","v":0},null,null,null,null,null,null,null,null,null,null,null,null,null,null,null,{"$f":"SUMIFS($S$7:$S$8,$B$7:$B$8,$B32,$AG$7:$AG$8,\">0\")","v":0},null,null,null,null,null,null,null,null,null,null,null,null,null,null,null,{"$f":"SUMIFS($AI$7:$AI$8,$B$7:$B$8,$B32,$AW$7:$AW$8,\">0\")","v":0},null,null,null,null,null,null,null,null,null,null,null,null,null,null,null,{"$f":"SUMIFS($AY$7:$AY$8,$B$7:$B$8,$B32,$BM$7:$BM$8,\">0\")","v":0},null,null,null,null,null,null,null,null,null,null,null,null,null,null,null,{"$f":"SUMIFS($BO$7:$BO$8,$B$7:$B$8,$B32,$CC$7:$CC$8,\">0\")","v":0},null,null,null,null,null,null,null,null,null,null,null,null,null,null,null,{"$f":"SUMIFS($CE$7:$CE$8,$B$7:$B$8,$B32,$CS$7:$CS$8,\">0\")","v":0},null,null,null,null,null,null,null,null,null,null,null,null,null,null,null,{"$f":"SUMIFS($CU$7:$CU$8,$B$7:$B$8,$B32,$DI$7:$DI$8,\">0\")","v":0}]
["Anzahl Sonst.","Sonst.",{"$f":"SUMIFS($C$7:$C$8,$B$7:$B$8,$B33,$Q$7:$Q$8,\">0\")","v":0},null,null,null,null,null,null,null,null,null,null,null,null,null,null,null,{"$f":"SUMIFS($S$7:$S$8,$B$7:$B$8,$B33,$AG$7:$AG$8,\">0\")","v":0},null,null,null,null,null,null,null,null,null,null,null,null,null,null,null,{"$f":"SUMIFS($AI$7:$AI$8,$B$7:$B$8,$B33,$AW$7:$AW$8,\">0\")","v":0},null,null,null,null,null,null,null,null,null,null,null,null,null,null,null,{"$f":"SUMIFS($AY$7:$AY$8,$B$7:$B$8,$B33,$BM$7:$BM$8,\">0\")","v":0},null,null,null,null,null,null,null,null,null,null,null,null,null,null,null,{"$f":"SUMIFS($BO$7:$BO$8,$B$7:$B$8,$B33,$CC$7:$CC$8,\">0\")","v":0},null,null,null,null,null,null,null,null,null,null,null,null,null,null,null,{"$f":"SUMIFS($CE$7:$CE$8,$B$7:$B$8,$B33,$CS$7:$CS$8,\">0\")","v":0},null,null,null,null,null,null,null,null,null,null,null,null,null,null,null,{"$f":"SUMIFS($CU$7:$CU$8,$B$7:$B$8,$B33,$DI$7:$DI$8,\">0\")","v":0}]
["Anzahl Objekte ges.",null,{"$f":"SUM(C30:C33)","v":0},null,null,null,null,null,null,null,null,null,null,null,null,null,null,null,{"$f":"SUM(S30:S33)","v":0},null,null,null,null,null,null,null,null,null,null,null,null,null,null,null,{"$f":"SUM(AI30:AI33)","v":0},null,null,null,null,null,null,null,null,null,null,null,null,null,null,null,{"$f":"SUM(AY30:AY33)","v":0},null,null,null,null,null,null,null,null,null,null,null,null,null,null,null,{"$f":"SUM(BO30:BO33)","v":0},null,null,null,null,null,null,null,null,null,null,null,null,null,null,null,{"$f":"SUM(CE30:CE33)","v":0},null,null,null,null,null,null,null,null,null,null,null,null,null,null,null,{"$f":"SUM(CU30:CU33)","v":0}]
[]
["Anzahl EFH mit Keller","EFH",{"$f":"SUMIFS($C$7:$C$8,$B$7:$B$8,$B36,$G$7:$G$8,\">0\")","v":0},null,null,null,null,null,null,null,null,null,null,null,null,null,null,null,{"$f":"SUMIFS($S$7:$S$8,$B$7:$B$8,$B36,$W$7:$W$8,\">0\")","v":0},null,null,null,null,null,null,null,null,null,null,null,null,null,null,null,{"$f":"SUMIFS($AI$7:$AI$8,$B$7:$B$8,$B36,$AM$7:$AM$8,\">0\")","v":0},null,null,null,null,null,null,null,null,null,null,null,null,null,null,null,{"$f":"SUMIFS($AY$7:$AY$8,$B$7:$B$8,$B36,$BC$7:$BC$8,\">0\")","v":0},null,null,null,null,null,null,null,null,null,null,null,null,null,null,null,{"$f":"SUMIFS($BO$7:$BO$8,$B$7:$B$8,$B36,$BS$7:$BS$8,\">0\")","v":0},null,null,null,null,null,null,null,null,null,null,null,null,null,null,null,{"$f":"SUMIFS($CE$7:$CE$8,$B$7:$B$8,$B36,$CI$7:$CI$8,\">0\")","v":0},null,null,null,null,null,null,null,null,null,null,null,null,null,null,null,{"$f":"SUMIFS($CU$7:$CU$8,$B$7:$B$8,$B36,$CY$7:$CY$8,\">0\")","v":0}]
["Anzahl MFH mit Keller","MFH",{"$f":"SUMIFS($C$7:$C$8,$B$7:$B$8,$B37,$G$7:$G$8,\">0\")","v":0},null,null,null,null,null,null,null,null,null,null,null,null,null,null,null,{"$f":"SUMIFS($S$7:$S$8,$B$7:$B$8,$B37,$W$7:$W$8,\">0\")","v":0},null,null,null,null,null,null,null,null,null,null,null,null,null,null,null,{"$f":"SUMIFS($AI$7:$AI$8,$B$7:$B$8,$B37,$AM$7:$AM$8,\">0\")","v":0},null,null,null,null,null,null,null,null,null,null,null,null,null,null,null,{"$f":"SUMIFS($AY$7:$AY$8,$B$7:$B$8,$B37,$BC$7:$BC$8,\">0\")","v":0},null,null,null,null,null,null,null,null,null,null,null,null,null,null,null,{"$f":"SUMIFS($BO$7:$BO$8,$B$7:$B$8,$B37,$BS$7:$BS$8,\">0\")","v":0},null,null,null,null,null,null,null,null,null,null,null,null,null,null,null,{"$f":"SUMIFS($CE$7:$CE$8,$B$7:$B$8,$B37,$CI$7:$CI$8,\">0\")","v":0},null,null,null,null,null,null,null,null,null,null,null,null,null,null,null,{"$f":"SUMIFS($CU$7:$CU$8,$B$7:$B$8,$B37,$CY$7:$CY$8,\">0\")","v":0}]
[]
["Schaden bei Wohngebäude gesamt"]
["Schaden EFH ges. [€]","EFH",{"$f":"SUMIF($B$7:$B$8,$B40,$Q$7:$Q$8)","v":0},null,null,null,null,null,null,null,null,null,null,null,null,null,null,null,{"$f":"SUMIF($B$7:$B$8,$B40,$AG$7:$AG$8)","v":0},null,null,null,null,null,null,null,null,null,null,null,null,null,null,null,{"$f":"SUMIF($B$7:$B$8,$B40,$AW$7:$AW$8)","v":0},null,null,null,null,null,null,null,null,null,null,null,null,null,null,null,{"$f":"SUMIF($B$7:$B$8,$B40,$BM$7:$BM$8)","v":0},null,null,null,null,null,null,null,null,null,null,null,null,null,null,null,{"$f":"SUMIF($B$7:$B$8,$B40,$CC$7:$CC$8)","v":0},null,null,null,null,null,null,null,null,null,null,null,null,null,null,null,{"$f":"SUMIF($B$7:$B$8,$B40,$CS$7:$CS$8)","v":0},null,null,null,null,null,null,null,null,null,null,null,null,null,null,null,{"$f":"SUMIF($B$7:$B$8,$B40,$DI$7:$DI$8)","v":0}]
["Schaden MFH ges. [€]","MFH",{"$f":"SUMIF($B$7:$B$8,$B41,$Q$7:$Q$8)","v":0},null,null,null,null,null,null,null,null,null,null,null,null,null,null,null,{"$f":"SUMIF($B$7:$B$8,$B41,$AG$7:$AG$8)","v":0},null,null,null,null,null,null,null,null,null,null,null,null,null,null,null,{"$f":"SUMIF($B$7:$B$8,$B41,$AW$7:$AW$8)","v":0},null,null,null,null,null,null,null,null,null,null,null,null,null,null,null,{"$f":"SUMIF($B$7:$B$8,$B41,$BM$7:$BM$8)","v":0},null,null,null,null,null,null,null,null,null,null,null,null,null,null,null,{"$f":"SUMIF($B$7:$B$8,$B41,$CC$7:$CC$8)","v":0},null,null,null,null,null,null,null,null,null,null,null,null,null,null,null,{"$f":"SUMIF($B$7:$B$8,$B41,$CS$7:$CS$8)","v":0},null,null,null,null,null,null,null,null,null,null,null,null,null,null,null,{"$f":"SUMIF($B$7:$B$8,$B41,$DI$7:$DI$8)","v":0}]
["Schaden RH ges. [€]","RH",{"$f":"SUMIF($B$7:$B$8,$B42,$Q$7:$Q$8)","v":0},null,null,null,null,null,null,null,null,null,null,null,null,null,null,null,{"$f":"SUMIF($B$7:$B$8,$B42,$AG$7:$AG$8)","v":0},null,null,null,null,null,null,null,null,null,null,null,null,null,null,null,{"$f":"SUMIF($B$7:$B$8,$B42,$AW$7:$AW$8)","v":0},null,null,null,null,null,null,null,null,null,null,null,null,null,null,null,{"$f":"SUMIF($B$7:$B$8,$B42,$BM$7:$BM$8)","v":0},null,null,null,null,null,null,null,null,null,null,null,null,null,null,null,{"$f":"SUMIF($B$7:$B$8,$B42,$CC$7:$CC$8)","v":0},null,null,null,null,null,null,null,null,null,null,null,null,null,null,null,{"$f":"SUMIF($B$7:$B$8,$B42,$CS$7:$CS$8)","v":0},null,null,null,null,null,null,null,null,null,null,null,null,null,null,null,{"$f":"SUMIF($B$7:$B$8,$B42,$DI$7:$DI$8)","v":0}]
["Schaden Sonst. ges. [€]","Sonst.",{"$f":"SUMIF($B$7:$B$8,$B43,$Q$7:$Q$8)","v":0},null,null,null,null,null,null,null,null,null,null,null,null,null,null,null,{"$f":"SUMIF($B$7:$B$8,$B43,$AG$7:$AG$8)","v":0},null,null,null,null,null,null,null,null,null,null,null,null,null,null,null,{"$f":"SUMIF($B$7:$B$8,$B43,$AW$7:$AW$8)","v":0},null,null,null,null,null,null,null,null,null,null,null,null,null,null,null,{"$f":"SUMIF($B$7:$B$8,$B43,$BM$7:$BM$8)","v":0},null,null,null,null,null,null,null,null,null,null,null,null,null,null,null,{"$f":"SUMIF($B$7:$B$8,$B43,$CC$7:$CC$8)","v":0},null,null,null,null,null,null,null,null,null,null,null,null,null,null,null,{"$f":"SUMIF($B$7:$B$8,$B43,$CS$7:$CS$8)","v":0},null,null,null,null,null,null,null,null,null,null,null,null,null,null,null,{"$f":"SUMIF($B$7:$B$8,$B43,$DI$7:$DI$8)","v":0}]
["Schaden Objekte ges. [€]",null,{"$f":"SUM($Q$7:$Q$8)","v":0},null,null,null,null,null,null,null,null,null,null,null,null,null,null,null,{"$f":"SUM($AG$7:$AG$8)","v":0},null,null,null,null,null,null,null,null,null,null,null,null,null,null,null,{"$f":"SUM($AW$7:$AW$8)","v":0},null,null,null,null,null,null,null,null,null,null,null,null,null,null,null,{"$f":"SUM($BM$7:$BM$8)","v":0},null,null,null,null,null,null,null,null,null,null,null,null,null,null,null,{"$f":"SUM($CC$7:$CC$8)","v":0},null,null,null,null,null,null,null,null,null,null,null,null,null,null,null,{"$f":"SUM($CS$7:$CS$8)","v":0},null,null,null,null,null,null,null,null,null,null,null,null,null,null,null,{"$f":"SUM($DI$7:$DI$8)","v":0}]
[]
["Schaden Keller EFH ges. [€]","EFH",{"$f":"SUMIF($B$7:$B$8,$B46,$G$7:$G$8)","v":0},null,null,null,null,null,null,null,null,null,null,null,null,null,null,null,{"$f":"SUMIF($B$7:$B$8,$B46,$W$7:$W$8)","v":0},null,null,null,null,null,null,null,null,null,null,null,null,null,null,null,{"$f":"SUMIF($B$7:$B$8,$B46,$AM$7:$AM$8)","v":0},null,null,null,null,null,null,null,null,null,null,null,null,null,null,null,{"$f":"SUMIF($B$7:$B$8,$B46,$BC$7:$BC$8)","v":0},null,null,null,null,null,null,null,null,null,null,null,null,null,null,null,{"$f":"SUMIF($B$7:$B$8,$B46,$BS$7:$BS$8)","v":0},null,null,null,null,null,null,null,null,null,null,null,null,null,null,null,{"$f":"SUMIF($B$7:$B$8,$B46,$CI$7:$CI$8)","v":0},null,null,null,null,null,null,null,null,null,null,null,null,null,null,null,{"$f":"SUMIF($B$7:$B$8,$B46,$CY$7:$CY$8)","v":0}]
["Schaden Keller MFH ges. [€]","MFH",{"$f":"SUMIF($B$7:$B$8,$B47,$G$7:$G$8)","v":0},null,null,null,null,null,null,null,null,null,null,null,null,null,null,null,{"$f":"SUMIF($B$7:$B$8,$B47,$W$7:$W$8)","v":0},null,null,null,null,null,null,null,null,null,null,null,null,null,null,null,{"$f":"SUMIF($B$7:$B$8,$B47,$AM$7:$AM$8)","v":0},null,null,null,null,null,null,null,null,null,null,null,null,null,null,null,{"$f":"SUMIF($B$7:$B$8,$B47,$BC$7:$BC$8)","v":0},null,null,null,null,null,null,null,null,null,null,null,null,null,null,null,{"$f":"SUMIF($B$7:$B$8,$B47,$BS$7:$BS$8)","v":0},null,null,null,null,null,null,null,null,null,null,null,null,null,null,null,{"$f":"SUMIF($B$7:$B$8,$B47,$CI$7:$CI$8)","v":0},null,null,null,null,null,null,null,null,null,null,null,null,null,null,null,{"$f":"SUMIF($B$7:$B$8,$B47,$CY$7:$CY$8)","v":0}]
["Schaden Erdgeschoß EFH ges. [€]","EFH",{"$f":"SUMIF($B$7:$B$8,$B48,$J$7:$J$8)","v":0},null,null,null,null,null,null,null,null,null,null,null,null,null,null,null,{"$f":"SUMIF($B$7:$B$8,$B48,$Z$7:$Z$8)","v":0},null,null,null,null,null,null,null,null,null,null,null,null,null,null,null,{"$f":"SUMIF($B$7:$B$8,$B48,$AP$7:$AP$8)","v":0},null,null,null,null,null,null,null,null,null,null,null,null,null,null,null,{"$f":"SUMIF($B$7:$B$8,$B48,$BF$7:$BF$8)","v":0},null,null,null,null,null,null,null,null,null,null,null,null,null,null,null,{"$f":"SUMIF($B$7:$B$8,$B48,$BV$7:$BV$8)","v":0},null,null,null,null,null,null,null,null,null,null,null,null,null,null,null,{"$f":"SUMIF($B$7:$B$8,$B48,$CL$7:$CL$8)","v":0},null,null,null,null,null,null,null,null,null,null,null,null,null,null,null,{"$f":"SUMIF($B$7:$B$8,$B48,$DB$7:$DB$8)","v":0}]
["Schaden Erdgeschoß MFH ges. [€]","MFH",{"$f":"SUMIF($B$7:$B$8,$B49,$J$7:$J$8)","v":0},null,null,null,null,null,null,null,null,null,null,null,null,null,null,null,{"$f":"SUMIF($B$7:$B$8,$B49,$Z$7:$Z$8)","v":0},null,null,null,null,null,null,null,null,null,null,null,null,null,null,null,{"$f":"SUMIF($B$7:$B$8,$B49,$AP$7:$AP$8)","v":0},null,null,null,null,null,null,null,null,null,null,null,null,null,null,null,{"$f":"SUMIF($B$7:$B$8,$B49,$BF$7:$BF$8)","v":0},null,null,null,null,null,null,null,null,null,null,null,null,null,null,null,{"$f":"SUMIF($B$7:$B$8,$B49,$BV$7:$BV$8)","v":0},null,null,null,null,null,null,null,null,null,null,null,null,null,null,null,{"$f":"SUMIF($B$7:$B$8,$B49,$CL$7:$CL$8)","v":0},null,null,null,null,null,null,null,null,null,null,null,null,null,null,null,{"$f":"SUMIF($B$7:$B$8,$B49,$CY$7:$CY$8)","v":0}]
[]
["Mittlerer Schaden bei Wohngebäuden"]
["Schaden je EFH  [€]","EFH",{"$f":"IF(C30=0,0,C40/C30)","v":0},null,null,null,null,null,null,null,null,null,null,null,null,null,null,null,{"$f":"IF(S30=0,0,S40/S30)","v":0},null,null,null,null,null,null,null,null,null,null,null,null,null,null,null,{"$f":"IF(AI30=0,0,AI40/AI30)","v":0},null,null,null,null,null,null,null,null,null,null,null,null,null,null,null,{"$f":"IF(AY30=0,0,AY40/AY30)","v":0},null,null,null,null,null,null,null,null,null,null,null,null,null,null,null,{"$f":"IF(BO30=0,0,BO40/BO30)","v":0},null,null,null,null,null,null,null,null,null,null,null,null,null,null,null,{"$f":"IF(CE30=0,0,CE40/CE30)","v":0},null,null,null,null,null,null,null,null,null,null,null,null,null,null,null,{"$f":"IF(CU30=0,0,CU40/CU30)","v":0}]
["Schaden je MFH [€]","MFH",{"$f":"IF(C31=0,0,C41/C31)","v":0},null,null,null,null,null,null,null,null,null,null,null,null,null,null,null,{"$f":"IF(S31=0,0,S41/S31)","v":0},null,null,null,null,null,null,null,null,null,null,null,null,null,null,null,{"$f":"IF(AI31=0,0,AI41/AI31)","v":0},null,null,null,null,null,null,null,null,null,null,null,null,null,null,null,{"$f":"IF(AY31=0,0,AY41/AY31)","v":0},null,null,null,null,null,null,null,null,null,null,null,null,null,null,null,{"$f":"IF(BO31=0,0,BO41/BO31)","v":0},null,null,null,null,null,null,null,null,null,null,null,null,null,null,null,{"$f":"IF(CE31=0,0,CE41/CE31)","v":0},null,null,null,null,null,null,null,null,null,null,null,null,null,null,null,{"$f":"IF(CU31=0,0,CU41/CU31)","v":0}]
["Schaden je RH [€]","RH",{"$f":"IF(C32=0,0,C42/C32)","v":0},null,null,null,null,null,null,null,null,null,null,null,null,null,null,null,{"$f":"IF(S32=0,0,S42/S32)","v":0},null,null,null,null,null,null,null,null,null,null,null,null,null,null,null,{"$f":"IF(AI32=0,0,AI42/AI32)","v":0},null,null,null,null,null,null,null,null,null,null,null,null,null,null,null,{"$f":"IF(AY32=0,0,AY42/AY32)","v":0},null,null,null,null,null,null,null,null,null,null,null,null,null,null,null,{"$f":"IF(BO32=0,0,BO42/BO32)","v":0},null,null,null,null,null,null,null,null,null,null,null,null,null,null,null,{"$f":"IF(CE32=0,0,CE42/CE32)","v":0},null,null,null,null,null,null,null,null,null,null,null,null,null,null,null,{"$f":"IF(CU32=0,0,CU42/CU32)","v":0}]
["Schaden je Sonst. [€]","Sonst.",{"$f":"IF(C33=0,0,C43/C33)","v":0},null,null,null,null,null,null,null,null,null,null,null,null,null,null,null,{"$f":"IF(S33=0,0,S43/S33)","v":0},null,null,null,null,null,null,null,null,null,null,null,null,null,null,null,{"$f":"IF(AI33=0,0,AI43/AI33)","v":0},null,null,null,null,null,null,null,null,null,null,null,null,null,null,null,{"$f":"IF(AY33=0,0,AY43/AY33)","v":0},null,null,null,null,null,null,null,null,null,null,null,null,null,null,null,{"$f":"IF(BO33=0,0,BO43/BO33)","v":0},null,null,null,null,null,null,null,null,null,null,null,null,null,null,null,{"$f":"IF(CE33=0,0,CE43/CE33)","v":0},null,null,null,null,null,null,null,null,null,null,null,null,null,null,null,{"$f":"IF(CU33=0,0,CU43/CU33)","v":0}]
["Schaden je Objekt [€]",null,{"$f":"IF(C34=0,0,C44/C34)","v":0},null,null,null,null,null,null,null,null,null,null,null,null,null,null,null,{"$f":"IF(S34=0,0,S44/S34)","v":0},null,null,null,null,null,null,null,null,null,null,null,null,null,null,null,{"$f":"IF(AI34=0,0,AI44/AI34)","v":0},null,null,null,null,null,null,null,null,null,null,null,null,null,null,null,{"$f":"IF(AY34=0,0,AY44/AY34)","v":0},null,null,null,null,null,null,null,null,null,null,null,null,null,null,null,{"$f":"IF(BO34=0,0,BO44/BO34)","v":0},null,null,null,null,null,null,null,null,null,null,null,null,null,null,null,{"$f":"IF(CE34=0,0,CE44/CE34)","v":0},null,null,null,null,null,null,null,null,null,null,null,null,null,null,null,{"$f":"IF(CU34=0,0,CU44/CU34)","v":0}]
["Mittl. Wassertiefe bei WG [m]",null,{"$f":"IF(ISERROR(AVERAGE($D$7:$D$8)),\"\",AVERAGE($D$7:$D$8))","v":""},null,null,null,null,null,null,null,null,null,null,null,null,null,null,null,{"$f":"IF(ISERROR(AVERAGE($T$7:$T$8)),\"\",AVERAGE($T$7:$T$8))","v":""},null,null,null,null,null,null,null,null,null,null,null,null,null,null,null,{"$f":"IF(ISERROR(AVERAGE($AJ$7:$AJ$8)),\"\",AVERAGE($AJ$7:$AJ$8))","v":""},null,null,null,null,null,null,null,null,null,null,null,null,null,null,null,{"$f":"IF(ISERROR(AVERAGE($AZ$7:$AZ$8)),\"\",AVERAGE($AZ$7:$AZ$8))","v":""},null,null,null,null,null,null,null,null,null,null,null,null,null,null,null,{"$f":"IF(ISERROR(AVERAGE($BP$7:$BP$8)),\"\",AVERAGE($BP$7:$BP$8))","v":""},null,null,null,null,null,null,null,null,null,null,null,null,null,null,null,{"$f":"IF(ISERROR(AVERAGE($CF$7:$CF$8)),\"\",AVERAGE($CF$7:$CF$8))","v":""},null,null,null,null,null,null,null,null,null,null,null,null,null,null,null,{"$f":"IF(ISERROR(AVERAGE($CV$7:$CV$8)),\"\",AVERAGE($CV$7:$CV$8))","v":""}]
[]
["Schaden je Keller EFH","EFH",{"$f":"IF(C36=0,\"\",C46/C36)","v":""},null,null,null,null,null,null,null,null,null,null,null,null,null,null,null,{"$f":"IF(S36=0,\"\",S46/S36)","v":""},null,null,null,null,null,null,null,null,null,null,null,null,null,null,null,{"$f":"IF(AI36=0,\"\",AI46/AI36)","v":""},null,null,null,null,null,null,null,null,null,null,null,null,null,null,null,{"$f":"IF(AY36=0,\"\",AY46/AY36)","v":""},null,null,null,null,null,null,null,null,null,null,null,null,null,null,null,{"$f":"IF(BO36=0,\"\",BO46/BO36)","v":""},null,null,null,null,null,null,null,null,null,null,null,null,null,null,null,{"$f":"IF(CE36=0,\"\",CE46/CE36)","v":""},null,null,null,null,null,null,null,null,null,null,null,null,null,null,null,{"$f":"IF(CU36=0,\"\",CU46/CU36)","v":""}]
["Schaden je Keller MFH","MFH",{"$f":"IF(C37=0,\"\",C47/C37)","v":""},null,null,null,null,null,null,null,null,null,null,null,null,null,null,null,{"$f":"IF(S37=0,\"\",S47/S37)","v":""},null,null,null,null,null,null,null,null,null,null,null,null,null,null,null,{"$f":"IF(AI37=0,\"\",AI47/AI37)","v":""},null,null,null,null,null,null,null,null,null,null,null,null,null,null,null,{"$f":"IF(AY37=0,\"\",AY47/AY37)","v":""},null,null,null,null,null,null,null,null,null,null,null,null,null,null,null,{"$f":"IF(BO37=0,\"\",BO47/BO37)","v":""},null,null,null,null,null,null,null,null,null,null,null,null,null,null,null,{"$f":"IF(CE37=0,\"\",CE47/CE37)","v":""},null,null,null,null,null,null,null,null,null,null,null,null,null,null,null,{"$f":"IF(CU37=0,\"\",CU47/CU37)","v":""}]
["Schaden je EG EFH","EFH",{"$f":"IF(SUMIFS(C$7:C$8,$B$7:$B$8,$B61,J$7:J$8,\">0\")=0,\"\",C48/SUMIFS(C$7:C$8,$B$7:$B$8,$B61,J$7:J$8,\">0\"))","v":""},null,null,null,null,null,null,null,null,null,null,null,null,null,null,null,{"$f":"IF(SUMIFS(S$7:S$8,$B$7:$B$8,$B61,Z$7:Z$8,\">0\")=0,\"\",S48/SUMIFS(S$7:S$8,$B$7:$B$8,$B61,Z$7:Z$8,\">0\"))","v":""},null,null,null,null,null,null,null,null,null,null,null,null,null,null,null,{"$f":"IF(SUMIFS(AI$7:AI$8,$B$7:$B$8,$B61,AP$7:AP$8,\">0\")=0,\"\",AI48/SUMIFS(AI$7:AI$8,$B$7:$B$8,$B61,AP$7:AP$8,\">0\"))","v":""},null,null,null,null,null,null,null,null,null,null,null,null,null,null,null,{"$f":"IF(SUMIFS(AY$7:AY$8,$B$7:$B$8,$B61,BF$7:BF$8,\">0\")=0,\"\",AY48/SUMIFS(AY$7:AY$8,$B$7:$B$8,$B61,BF$7:BF$8,\">0\"))","v":""},null,null,null,null,null,null,null,null,null,null,null,null,null,null,null,{"$f":"IF(SUMIFS(BO$7:BO$8,$B$7:$B$8,$B61,BV$7:BV$8,\">0\")=0,\"\",BO48/SUMIFS(BO$7:BO$8,$B$7:$B$8,$B61,BV$7:BV$8,\">0\"))","v":""},null,null,null,null,null,null,null,null,null,null,null,null,null,null,null,{"$f":"IF(SUMIFS(CE$7:CE$8,$B$7:$B$8,$B61,CL$7:CL$8,\">0\")=0,\"\",CE48/SUMIFS(CE$7:CE$8,$B$7:$B$8,$B61,CL$7:CL$8,\">0\"))","v":""},null,null,null,null,null,null,null,null,null,null,null,null,null,null,null,{"$f":"IF(SUMIFS(CU$7:CU$8,$B$7:$B$8,$B61,DB$7:DB$8,\">0\")=0,\"\",CU48/SUMIFS(CU$7:CU$8,$B$7:$B$8,$B61,DB$7:DB$8,\">0\"))","v":""}]
["Schaden je EG MFH","MFH",{"$f":"IF(SUMIFS(C$7:C$8,$B$7:$B$8,$B62,J$7:J$8,\">0\")=0,\"\",C49/SUMIFS(C$7:C$8,$B$7:$B$8,$B62,J$7:J$8,\">0\"))","v":""},null,null,null,null,null,null,null,null,null,null,null,null,null,null,null,{"$f":"IF(SUMIFS(S$7:S$8,$B$7:$B$8,$B62,Z$7:Z$8,\">0\")=0,\"\",S49/SUMIFS(S$7:S$8,$B$7:$B$8,$B62,Z$7:Z$8,\">0\"))","v":""},null,null,null,null,null,null,null,null,null,null,null,null,null,null,null,{"$f":"IF(SUMIFS(AI$7:AI$8,$B$7:$B$8,$B62,AP$7:AP$8,\">0\")=0,\"\",AI49/SUMIFS(AI$7:AI$8,$B$7:$B$8,$B62,AP$7:AP$8,\">0\"))","v":""},null,null,null,null,null,null,null,null,null,null,null,null,null,null,null,{"$f":"IF(SUMIFS(AY$7:AY$8,$B$7:$B$8,$B62,BF$7:BF$8,\">0\")=0,\"\",AY49/SUMIFS(AY$7:AY$8,$B$7:$B$8,$B62,BF$7:BF$8,\">0\"))","v":""},null,null,null,null,null,null,null,null,null,null,null,null,null,null,null,{"$f":"IF(SUMIFS(BO$7:BO$8,$B$7:$B$8,$B62,BV$7:BV$8,\">0\")=0,\"\",BO49/SUMIFS(BO$7:BO$8,$B$7:$B$8,$B62,BV$7:BV$8,\">0\"))","v":""},null,null,null,null,null,null,null,null,null,null,null,null,null,null,null,{"$f":"IF(SUMIFS(CE$7:CE$8,$B$7:$B$8,$B62,CL$7:CL$8,\">0\")=0,\"\",CE49/SUMIFS(CE$7:CE$8,$B$7:$B$8,$B62,CL$7:CL$8,\">0\"))","v":""},null,null,null,null,null,null,null,null,null,null,null,null,null,null,null,{"$f":"IF(SUMIFS(CU$7:CU$8,$B$7:$B$8,$B62,DB$7:DB$8,\">0\")=0,\"\",CU49/SUMIFS(CU$7:CU$8,$B$7:$B$8,$B62,DB$7:DB$8,\">0\"))","v":""}]
[]
["Schadensanteil Keller an Gesamtschaden EFH",null,{"$f":"IF(C40=0,\"\",C46/C40)","v":""},null,null,null,null,null,null,null,null,null,null,null,null,null,null,null,{"$f":"IF(S40=0,\"\",S46/S40)","v":""},null,null,null,null,null,null,null,null,null,null,null,null,null,null,null,{"$f":"IF(AI40=0,\"\",AI46/AI40)","v":""},null,null,null,null,null,null,null,null,null,null,null,null,null,null,null,{"$f":"IF(AY40=0,\"\",AY46/AY40)","v":""},null,null,null,null,null,null,null,null,null,null,null,null,null,null,null,{"$f":"IF(BO40=0,\"\",BO46/BO40)","v":""},null,null,null,null,null,null,null,null,null,null,null,null,null,null,null,{"$f":"IF(CE40=0,\"\",CE46/CE40)","v":""},null,null,null,null,null,null,null,null,null,null,null,null,null,null,null,{"$f":"IF(CU40=0,\"\",CU46/CU40)","v":""}]
["Schadensanteil EG an Gesamtschaden EFH",null,{"$f":"IF(C40=0,\"\",C48/C40)","v":""},null,null,null,null,null,null,null,null,null,null,null,null,null,null,null,{"$f":"IF(S40=0,\"\",S48/S40)","v":""},null,null,null,null,null,null,null,null,null,null,null,null,null,null,null,{"$f":"IF(AI40=0,\"\",AI48/AI40)","v":""},null,null,null,null,null,null,null,null,null,null,null,null,null,null,null,{"$f":"IF(AY40=0,\"\",AY48/AY40)","v":""},null,null,null,null,null,null,null,null,null,null,null,null,null,null,null,{"$f":"IF(BO40=0,\"\",BO48/BO40)","v":""},null,null,null,null,null,null,null,null,null,null,null,null,null,null,null,{"$f":"IF(CE40=0,\"\",CE48/CE40)","v":""},null,null,null,null,null,null,null,null,null,null,null,null,null,null,null,{"$f":"IF(CU40=0,\"\",CU48/CU40)","v":""}]
["Schadensanteil Keller an Gesamtschaden MFH",null,{"$f":"IF(C41=0,\"\",C47/C41)","v":""},null,null,null,null,null,null,null,null,null,null,null,null,null,null,null,{"$f":"IF(S41=0,\"\",S47/S41)","v":""},null,null,null,null,null,null,null,null,null,null,null,null,null,null,null,{"$f":"IF(AI41=0,\"\",AI47/AI41)","v":""},null,null,null,null,null,null,null,null,null,null,null,null,null,null,null,{"$f":"IF(AY41=0,\"\",AY47/AY41)","v":""},null,null,null,null,null,null,null,null,null,null,null,null,null,null,null,{"$f":"IF(BO41=0,\"\",BO47/BO41)","v":""},null,null,null,null,null,null,null,null,null,null,null,null,null,null,null,{"$f":"IF(CE41=0,\"\",CE47/CE41)","v":""},null,null,null,null,null,null,null,null,null,null,null,null,null,null,null,{"$f":"IF(CU41=0,\"\",CU47/CU41)","v":""}]
["Schadensanteil EG an Gesamtschaden MFH",null,{"$f":"IF(C41=0,\"\",C49/C41)","v":""},null,null,null,null,null,null,null,null,null,null,null,null,null,null,null,{"$f":"IF(S41=0,\"\",S49/S41)","v":""},null,null,null,null,null,null,null,null,null,null,null,null,null,null,null,{"$f":"IF(AI41=0,\"\",AI49/AI41)","v":""},null,null,null,null,null,null,null,null,null,null,null,null,null,null,null,{"$f":"IF(AY41=0,\"\",AY49/AY41)","v":""},null,null,null,null,null,null,null,null,null,null,null,null,null,null,null,{"$f":"IF(BO41=0,\"\",BO49/BO41)","v":""},null,null,null,null,null,null,null,null,null,null,null,null,null,null,null,{"$f":"IF(CE41=0,\"\",CE49/CE41)","v":""},null,null,null,null,null,null,null,null,null,null,null,null,null,null,null,{"$f":"IF(CU41=0,\"\",CU49/CU41)","v":""}]

{"sheet":"Schadensrel. MM NichtWGebäude","index":7,"n_rows":8,"n_cols":25,"rows_kept":8,"cut":false,"hidden":false,"merged":[[4,22,5,22],[4,23,5,23],[4,24,5,24],[5,2,5,16],[0,0,0,24],[2,17,2,24],[3,17,3,18],[3,19,3,20],[3,21,3,23],[4,17,5,17],[4,18,5,18],[4,19,5,19],[4,20,5,20],[4,21,5,21]]}
["SCHADENSRELEVANTE MERKMALE NICHT - WOHNGEBÄUDE"]
[]
[null,null,null,null,null,null,null,null,null,null,null,null,null,null,null,null,null,"Schadensbeurteilungen (siehe Erläuterungen)\n(nur bei Schadensermittlung mittels Schadensfunktion erforderlich)"]
[null,null,null,null,null,null,null,null,null,null,null,null,null,null,null,null,null,"Untergeschoß",null,"Erdgeschoss",null,"Stockwerk",null,null,"Aussenanlagen"]
["Adresse","Name Betrieb","Betroffene Gebäude (z.B. Halle, Werkstätte, Lager, Bürogebäude, etc.)","Bauwerkstyp","Erhaltungszustand des Gebäudes","Untergeschoß vorhanden","Nutzung","Höhe Untergeschoß (in m)\n(SIEHE ERLÄUTERUNGEN)","Decke Untergeschoß (in m)","Höhe Erdgeschoss (in m)","Decke Erdgeschoss (in m)","Höhe 1. Stock (in m)","Lage Fussbodenoberkante EG","Höhe erste Fussbodenoberkante über Gelände (in m)","Wassereintritt in den Keller nur vom Hausinneren, aus dem EG möglich?","Außenanlagen \n(Ja/Nein)","bekannte Hochwasserschäden\n(Jahr, Wassertiefe über Fußboden EG, Schaden in Keller, EG, Stockwerk)","Untergeschoß\nAnfangsschaden \n(Smin) in €","Untergeschoß\nSchaden bei 1m Wassertiefe in 1.000 €\n(B)","Erdgeschoß\nAnfangsschaden \n(Smin) in €","Erdgeschoß\nSchaden bei 1m Wassertiefe in 1.000 €\n(B)","1. Stock\nAnfangsschaden \n(Smin) in €","Höhe über GOK","1:Stock\nSchaden bei 1m Wassertiefe in 1.000 €\n(B)","Aussenanlagen\nSchaden in €"]
["Gemeinde, Straße, Hausnummer"]
[null,null,null,"ZH","sehr gut","Nein","hoch",null,null,null,null,null,"Ebenerdig",null,"Nein","Ja"]
[null,null,null,null,null,"Nein",null,null,null,null,null,null,null,null,"Nein","Ja"]

{"sheet":"Schadensermittl.  NichtWGebäude","index":8,"n_rows":12,"n_cols":114,"rows_kept":12,"cut":false,"hidden":false,"merged":[[10,98,10,113],[11,2,11,17],[11,18,11,33],[11,34,11,49],[11,50,11,65],[11,66,11,81],[11,82,11,97],[11,98,11,113],[10,2,10,17],[10,18,10,33],[10,34,10,49],[10,50,10,65],[10,66,10,81],[10,82,10,97],[0,98,0,113],[4,2,4,17],[4,18,4,33],[4,34,4,49],[4,50,4,65],[4,66,4,81],[4,82,4,97],[4,98,4,113],[0,2,0,17],[0,18,0,33],[0,34,0,49],[0,50,0,65],[0,66,0,81],[0,82,0,97]]}
["SCHADENSERMITTLUNG UND -EINGABE NICHT-WOHNGEBÄUDE",null,{"$f":"+$A$1","v":"SCHADENSERMITTLUNG UND -EINGABE NICHT-WOHNGEBÄUDE"},null,null,null,null,null,null,null,null,null,null,null,null,null,null,null,{"$f":"C1","v":"SCHADENSERMITTLUNG UND -EINGABE NICHT-WOHNGEBÄUDE"},null,null,null,null,null,null,null,null,null,null,null,null,null,null,null,{"$f":"S1","v":"SCHADENSERMITTLUNG UND -EINGABE NICHT-WOHNGEBÄUDE"},null,null,null,null,null,null,null,null,null,null,null,null,null,null,null,{"$f":"AI1","v":"SCHADENSERMITTLUNG UND -EINGABE NICHT-WOHNGEBÄUDE"},null,null,null,null,null,null,null,null,null,null,null,null,null,null,null,{"$f":"AY1","v":"SCHADENSERMITTLUNG UND -EINGABE NICHT-WOHNGEBÄUDE"},null,null,null,null,null,null,null,null,null,null,null,null,null,null,null,{"$f":"BO1","v":"SCHADENSERMITTLUNG UND -EINGABE NICHT-WOHNGEBÄUDE"},null,null,null,null,null,null,null,null,null,null,null,null,null,null,null,{"$f":"CE1","v":"SCHADENSERMITTLUNG UND -EINGABE NICHT-WOHNGEBÄUDE"}]
[]
[]
[]
[null,"bei HQx",{"$f":"Projektgrunddaten!C24","v":0},null,null,null,null,null,null,null,null,null,null,null,null,null,null,null,{"$f":"Projektgrunddaten!C25","v":0},null,null,null,null,null,null,null,null,null,null,null,null,null,null,null,{"$f":"Projektgrunddaten!C26","v":0},null,null,null,null,null,null,null,null,null,null,null,null,null,null,null,{"$f":"Projektgrunddaten!C27","v":0},null,null,null,null,null,null,null,null,null,null,null,null,null,null,null,{"$f":"Projektgrunddaten!C28","v":0},null,null,null,null,null,null,null,null,null,null,null,null,null,null,null,{"$f":"Projektgrunddaten!C29","v":100},null,null,null,null,null,null,null,null,null,null,null,null,null,null,null,{"$f":"Projektgrunddaten!C30","v":0}]
["Name Betrieb","Zuordnung des Betriebes zu einem Wirtschaftssektor","Wassertiefe über GOK (m)","Wasserstand Untergeschoß","ALTERNATIV zur Wassertiefe: Wasserstand Untergeschoß (m)","Schaden Untergeschoß (€)","Wasserstand Erdgeschoß","ALTERNATIV statt Wassertiefe:\nWasserstand Erdgeschoß (m)","Schaden Erdgeschoss (€)","Wasserstand 1. Stock","ALTERNATIV statt Wassertiefe:\nWasserstand 1. Stock (m)","Schaden 1. Stock (€)","Schaden Aussenanlagen €)","Reduktionsfaktor wegen Eigenvorsorge (siehe Erläuterungen)","Schaden gesamt \naus Berechnung mit Schadensfunktion (€)","ALTERNATIV: Bewertung ohne Schadensfunktion:\nSchadenseingabe gesamt aus gesonderten Erhebungen (€)","betroffene Beschäftigte","Ausfalltage (Arbeitstage)","Wassertiefe über GOK (m)","Wasserstand Untergeschoß","ALTERNATIV zur Wassertiefe: Wasserstand Untergeschoß (m)","Schaden Untergeschoß (€)","Wasserstand Erdgeschoß","ALTERNATIV statt Wassertiefe:\nWasserstand Erdgeschoß (m)","Schaden Erdgeschoss (€)","Wasserstand 1. Stock","ALTERNATIV statt Wassertiefe:\nWasserstand 1. Stock (m)","Schaden 1. Stock (€)","Schaden Aussenanlagen €)","Reduktionsfaktor wegen Eigenvorsorge (siehe Erläuterungen)","Schaden gesamt \naus Berechnung mit Schadensfunktion (€)","ALTERNATIV: Bewertung ohne Schadensfunktion:\nSchadenseingabe gesamt aus gesonderten Erhebungen (€)","betroffene Beschäftigte","Ausfalltage (Arbeitstage)","Wassertiefe über GOK (m)","Wasserstand Untergeschoß","ALTERNATIV zur Wassertiefe: Wasserstand Untergeschoß (m)","Schaden Untergeschoß (€)","Wasserstand Erdgeschoß","ALTERNATIV statt Wassertiefe:\nWasserstand Erdgeschoß (m)","Schaden Erdgeschoss (€)","Wasserstand 1. Stock","ALTERNATIV statt Wassertiefe:\nWasserstand 1. Stock (m)","Schaden 1. Stock (€)","Schaden Aussenanlagen €)","Reduktionsfaktor wegen Eigenvorsorge (siehe Erläuterungen)","Schaden gesamt \naus Berechnung mit Schadensfunktion (€)","ALTERNATIV: Bewertung ohne Schadensfunktion:\nSchadenseingabe gesamt aus gesonderten Erhebungen (€)","betroffene Beschäftigte","Ausfalltage (Arbeitstage)","Wassertiefe über GOK (m)","Wasserstand Untergeschoß","ALTERNATIV zur Wassertiefe: Wasserstand Untergeschoß (m)","Schaden Untergeschoß (€)","Wasserstand Erdgeschoß","ALTERNATIV statt Wassertiefe:\nWasserstand Erdgeschoß (m)","Schaden Erdgeschoss (€)","Wasserstand 1. Stock","ALTERNATIV statt Wassertiefe:\nWasserstand 1. Stock (m)","Schaden 1. Stock (€)","Schaden Aussenanlagen €)","Reduktionsfaktor wegen Eigenvorsorge (siehe Erläuterungen)","Schaden gesamt \naus Berechnung mit Schadensfunktion (€)","ALTERNATIV: Bewertung ohne Schadensfunktion:\nSchadenseingabe gesamt aus gesonderten Erhebungen (€)","betroffene Beschäftigte","Ausfalltage (Arbeitstage)","Wassertiefe über GOK (m)","Wasserstand Untergeschoß","ALTERNATIV zur Wassertiefe: Wasserstand Untergeschoß (m)","Schaden Untergeschoß (€)","Wasserstand Erdgeschoß","ALTERNATIV statt Wassertiefe:\nWasserstand Erdgeschoß (m)","Schaden Erdgeschoss (€)","Wasserstand 1. Stock","ALTERNATIV statt Wassertiefe:\nWasserstand 1. Stock (m)","Schaden 1. Stock (€)","Schaden Aussenanlagen €)","Reduktionsfaktor wegen Eigenvorsorge (siehe Erläuterungen)","Schaden gesamt \naus Berechnung mit Schadensfunktion (€)","ALTERNATIV: Bewertung ohne Schadensfunktion:\nSchadenseingabe gesamt aus gesonderten Erhebungen (€)","betroffene Beschäftigte","Ausfalltage (Arbeitstage)","Wassertiefe über GOK (m)","Wasserstand Untergeschoß","ALTERNATIV zur Wassertiefe: Wasserstand Untergeschoß (m)","Schaden Untergeschoß (€)","Wasserstand Erdgeschoß","ALTERNATIV statt Wassertiefe:\nWasserstand Erdgeschoß (m)","Schaden Erdgeschoss (€)","Wasserstand 1. Stock","ALTERNATIV statt Wassertiefe:\nWasserstand 1. Stock (m)","Schaden 1. Stock (€)","Schaden Aussenanlagen €)","Reduktionsfaktor wegen Eigenvorsorge (siehe Erläuterungen)","Schaden gesamt \naus Berechnung mit Schadensfunktion (€)","ALTERNATIV: Bewertung ohne Schadensfunktion:\nSchadenseingabe gesamt aus gesonderten Erhebungen (€)","betroffene Beschäftigte","Ausfalltage (Arbeitstage)","Wassertiefe über GOK (m)","Wasserstand Untergeschoß","ALTERNATIV zur Wassertiefe: Wasserstand Untergeschoß (m)","Schaden Untergeschoß (€)","Wasserstand Erdgeschoß","ALTERNATIV statt Wassertiefe:\nWasserstand Erdgeschoß (m)","Schaden Erdgeschoss (€)","Wasserstand 1. Stock","ALTERNATIV statt Wassertiefe:\nWasserstand 1. Stock (m)","Schaden 1. Stock (€)","Schaden Aussenanlagen €)","Reduktionsfaktor wegen Eigenvorsorge (siehe Erläuterungen)","Schaden gesamt \naus Berechnung mit Schadensfunktion (€)","ALTERNATIV: Bewertung ohne Schadensfunktion:\nSchadenseingabe gesamt aus gesonderten Erhebungen (€)","betroffene Beschäftigte","Ausfalltage (Arbeitstage)"]
[{"$f":"IF('Schadensrel. MM NichtWGebäude'!B7=\"\",\"\",'Schadensrel. MM NichtWGebäude'!B7)","v":""},"Beherbergung und Gastronomie (I)",null,{"$f":"IF(C7=0,0,IF(('Schadensrel. MM NichtWGebäude'!H7+'Schadensrel. MM NichtWGebäude'!I7)=0,(IF((Berechnungsgrundlagen!$I$18+Berechnungsgrundlagen!$I$19-'Schadensrel. MM NichtWGebäude'!$N7+C7)>(Berechnungsgrundlagen!$I$18+Berechnungsgrundlagen!$I$19),(Berechnungsgrundlagen!$I$18+Berechnungsgrundlagen!$I$19),(Berechnungsgrundlagen!$I$18+Berechnungsgrundlagen!$I$19-'Schadensrel. MM NichtWGebäude'!$N7+C7))),(IF(('Schadensrel. MM NichtWGebäude'!$H7+'Schadensrel. MM NichtWGebäude'!$I7-'Schadensrel. MM NichtWGebäude'!$N7+C7)>('Schadensrel. MM NichtWGebäude'!$H7+'Schadensrel. MM NichtWGebäude'!$I7),('Schadensrel. MM NichtWGebäude'!$H7+'Schadensrel. MM NichtWGebäude'!$I7),('Schadensrel. MM NichtWGebäude'!$H7+'Schadensrel. MM NichtWGebäude'!$I7-'Schadensrel. MM NichtWGebäude'!$N7+C7)))))","v":0},null,{"$f":"IF('Schadensrel. MM NichtWGebäude'!$F7=Berechnungsgrundlagen!$D$17,\n IF(E7>0,\n  'Schadensrel. MM NichtWGebäude'!$R7+(1000*'Schadensrel. MM NichtWGebäude'!$S7*SQRT(E7)),\n  IF(D7=0,\n   0,\n   IF('Schadensrel. MM NichtWGebäude'!$O7=Berechnungsgrundlagen!$D$18,\n    'Schadensrel. MM NichtWGebäude'!$R7+(1000*'Schadensrel. MM NichtWGebäude'!$S7*SQRT(D7)),\n     IF(C7<='Schadensrel. MM NichtWGebäude'!$N7,\n      0,\n      'Schadensrel. MM NichtWGebäude'!$R7+(1000*'Schadensrel. MM NichtWGebäude'!$S7*SQRT(D7)))))),0)","v":0},{"$f":"IF(C7=0,0,\nIF((C7-'Schadensrel. MM NichtWGebäude'!$N7)<=0,\n 0,\n IF(((C7-'Schadensrel. MM NichtWGebäude'!$N7))>(IF(\n    ('Schadensrel. MM NichtWGebäude'!$J7+'Schadensrel. MM NichtWGebäude'!$K7)=0,\n     (Berechnungsgrundlagen!$I$20+Berechnungsgrundlagen!$I$21),\n     ('Schadensrel. MM NichtWGebäude'!$J7+'Schadensrel. MM NichtWGebäude'!$K7))),\n  IF(('Schadensrel. MM NichtWGebäude'!$J7+'Schadensrel. MM NichtWGebäude'!$K7)=0,\n   (Berechnungsgrundlagen!$I$20+Berechnungsgrundlagen!$I$21),\n   ('Schadensrel. MM NichtWGebäude'!$J7+'Schadensrel. MM NichtWGebäude'!$K7)),\n  ((C7-'Schadensrel. MM NichtWGebäude'!$N7)))))","v":0},null,{"$f":"IF(H7>0,'Schadensrel. MM NichtWGebäude'!$T7+(1000*'Schadensrel. MM NichtWGebäude'!$U7*SQRT(H7)),IF(G7=0,0,IF(C7<='Schadensrel. MM NichtWGebäude'!$N7,0, 'Schadensrel. MM NichtWGebäude'!$T7+(1000*'Schadensrel. MM NichtWGebäude'!$U7*SQRT(G7)))))","v":0},{"$f":"IF(C7=0,\n 0,\n C7-('Schadensrel. MM NichtWGebäude'!$N7+\n   IF(('Schadensrel. MM NichtWGebäude'!$J7+'Schadensrel. Merkmale WGebäude'!$K7)=0,\n    Berechnungsgrundlagen!$I$20+Berechnungsgrundlagen!$I$21,\n    'Schadensrel. MM NichtWGebäude'!$J7+'Schadensrel. MM NichtWGebäude'!$K7)))","v":0},null,{"$f":"IF(K7>0,\n 'Schadensrel. MM NichtWGebäude'!$V7+(1000*'Schadensrel. MM NichtWGebäude'!$X7*SQRT(K7)),\n IF(C7<=('Schadensrel. MM NichtWGebäude'!N7+IF(\n    ('Schadensrel. MM NichtWGebäude'!$J7+'Schadensrel. MM NichtWGebäude'!$K7)=0,\n     Berechnungsgrundlagen!$I$20+Berechnungsgrundlagen!$I$21,\n     'Schadensrel. MM NichtWGebäude'!$J7+'Schadensrel. MM NichtWGebäude'!$K7)),\n  0,\n  ('Schadensrel. MM NichtWGebäude'!$V7+(1000*'Schadensrel. MM NichtWGebäude'!$X7*SQRT(J7)))))","v":0},{"$f":"IF(C7=0,0,'Schadensrel. MM NichtWGebäude'!$Y7)","v":0},null,{"$f":"SUM(F7+I7+L7+M7)*(IF($C$5>50,1,IF(N7=0,1,1-N7)))","v":0},null,null,null,null,{"$f":"IF(S7=0,0,IF(('Schadensrel. MM NichtWGebäude'!H7+'Schadensrel. MM NichtWGebäude'!I7)=0,(IF((Berechnungsgrundlagen!$I$18+Berechnungsgrundlagen!$I$19-'Schadensrel. MM NichtWGebäude'!$N7+$S7)>(Berechnungsgrundlagen!$I$18+Berechnungsgrundlagen!$I$19),(Berechnungsgrundlagen!$I$18+Berechnungsgrundlagen!$I$19),(Berechnungsgrundlagen!$I$18+Berechnungsgrundlagen!$I$19-'Schadensrel. MM NichtWGebäude'!$N7+$S7))),(IF(('Schadensrel. MM NichtWGebäude'!$H7+'Schadensrel. MM NichtWGebäude'!$I7-'Schadensrel. MM NichtWGebäude'!$N7+$S7)>('Schadensrel. MM NichtWGebäude'!$H7+'Schadensrel. MM NichtWGebäude'!$I7),('Schadensrel. MM NichtWGebäude'!$H7+'Schadensrel. MM NichtWGebäude'!$I7),('Schadensrel. MM NichtWGebäude'!$H7+'Schadensrel. MM NichtWGebäude'!$I7-'Schadensrel. MM NichtWGebäude'!$N7+$S7)))))","v":0},null,{"$f":"IF('Schadensrel. MM NichtWGebäude'!$F7=Berechnungsgrundlagen!$D$17,\n IF(U7>0,\n  'Schadensrel. MM NichtWGebäude'!$R7+(1000*'Schadensrel. MM NichtWGebäude'!$S7*SQRT(U7)),\n  IF(T7=0,\n   0,\n   IF('Schadensrel. MM NichtWGebäude'!$O7=Berechnungsgrundlagen!$D$18,\n    'Schadensrel. MM NichtWGebäude'!$R7+(1000*'Schadensrel. MM NichtWGebäude'!$S7*SQRT(T7)),\n     IF(S7<='Schadensrel. MM NichtWGebäude'!$N7,\n      0,\n      'Schadensrel. MM NichtWGebäude'!$R7+(1000*'Schadensrel. MM NichtWGebäude'!$S7*SQRT(T7)))))),0)","v":0},{"$f":"IF(S7=0,0,\nIF((S7-'Schadensrel. MM NichtWGebäude'!$N7)<=0,\n 0,\n IF(((S7-'Schadensrel. MM NichtWGebäude'!$N7))>(IF(\n    ('Schadensrel. MM NichtWGebäude'!$J7+'Schadensrel. MM NichtWGebäude'!$K7)=0,\n     (Berechnungsgrundlagen!$I$20+Berechnungsgrundlagen!$I$21),\n     ('Schadensrel. MM NichtWGebäude'!$J7+'Schadensrel. MM NichtWGebäude'!$K7))),\n  IF(('Schadensrel. MM NichtWGebäude'!$J7+'Schadensrel. MM NichtWGebäude'!$K7)=0,\n   (Berechnungsgrundlagen!$I$20+Berechnungsgrundlagen!$I$21),\n   ('Schadensrel. MM NichtWGebäude'!$J7+'Schadensrel. MM NichtWGebäude'!$K7)),\n  ((S7-'Schadensrel. MM NichtWGebäude'!$N7)))))","v":0},null,{"$f":"IF(X7>0,'Schadensrel. MM NichtWGebäude'!$T7+(1000*'Schadensrel. MM NichtWGebäude'!$U7*SQRT(X7)),IF(W7=0,0,IF(S7<='Schadensrel. MM NichtWGebäude'!$N7,0, 'Schadensrel. MM NichtWGebäude'!$T7+(1000*'Schadensrel. MM NichtWGebäude'!$U7*SQRT(W7)))))","v":0},{"$f":"IF(S7=0,\n 0,\n S7-('Schadensrel. MM NichtWGebäude'!$N7+\n   IF(('Schadensrel. MM NichtWGebäude'!$J7+'Schadensrel. Merkmale WGebäude'!$K7)=0,\n    Berechnungsgrundlagen!$I$20+Berechnungsgrundlagen!$I$21,\n    'Schadensrel. MM NichtWGebäude'!$J7+'Schadensrel. MM NichtWGebäude'!$K7)))","v":0},null,{"$f":"IF(AA7>0,\n 'Schadensrel. MM NichtWGebäude'!$V7+(1000*'Schadensrel. MM NichtWGebäude'!$X7*SQRT(AA7)),\n IF(S7<=('Schadensrel. MM NichtWGebäude'!N7+IF(\n    ('Schadensrel. MM NichtWGebäude'!$J7+'Schadensrel. MM NichtWGebäude'!$K7)=0,\n     Berechnungsgrundlagen!$I$20+Berechnungsgrundlagen!$I$21,\n     'Schadensrel. MM NichtWGebäude'!$J7+'Schadensrel. MM NichtWGebäude'!$K7)),\n  0,\n  ('Schadensrel. MM NichtWGebäude'!$V7+(1000*'Schadensrel. MM NichtWGebäude'!$X7*SQRT(Z7)))))","v":0},{"$f":"IF(S7=0,0,'Schadensrel. MM NichtWGebäude'!$Y7)","v":0},null,{"$f":"SUM(V7+Y7+AB7+AC7)*(IF($S$5>50,1,IF(AD7=0,1,1-AD7)))","v":0},null,null,null,null,{"$f":"IF(AI7=0,\n 0,\n IF(('Schadensrel. MM NichtWGebäude'!H7+'Schadensrel. MM NichtWGebäude'!I7)=0,\n  (IF((Berechnungsgrundlagen!$I$18+Berechnungsgrundlagen!$I$19-'Schadensrel. MM NichtWGebäude'!$N7+$AI7)>(Berechnungsgrundlagen!$I$18+Berechnungsgrundlagen!$I$19),\n   (Berechnungsgrundlagen!$I$18+Berechnungsgrundlagen!$I$19),\n   (Berechnungsgrundlagen!$I$18+Berechnungsgrundlagen!$I$19-'Schadensrel. MM NichtWGebäude'!$N7+$AI7))),\n (IF(('Schadensrel. MM NichtWGebäude'!$H7+'Schadensrel. MM NichtWGebäude'!$I7-'Schadensrel. MM NichtWGebäude'!$N7+$AI7)>('Schadensrel. MM NichtWGebäude'!$H7+'Schadensrel. MM NichtWGebäude'!$I7),\n  ('Schadensrel. MM NichtWGebäude'!$H7+'Schadensrel. MM NichtWGebäude'!$I7),\n  ('Schadensrel. MM NichtWGebäude'!$H7+'Schadensrel. MM NichtWGebäude'!$I7-'Schadensrel. MM NichtWGebäude'!$N7+$AI7)))))","v":0},null,{"$f":"IF('Schadensrel. MM NichtWGebäude'!$F7=Berechnungsgrundlagen!$D$17,\n IF(AK7>0,\n  'Schadensrel. MM NichtWGebäude'!$R7+(1000*'Schadensrel. MM NichtWGebäude'!$S7*SQRT(AK7)),\n  IF(AJ7=0,\n   0,\n   IF('Schadensrel. MM NichtWGebäude'!$O7=Berechnungsgrundlagen!$D$18,\n    'Schadensrel. MM NichtWGebäude'!$R7+(1000*'Schadensrel. MM NichtWGebäude'!$S7*SQRT(AJ7)),\n     IF(AI7<='Schadensrel. MM NichtWGebäude'!$N7,\n      0,\n      'Schadensrel. MM NichtWGebäude'!$R7+(1000*'Schadensrel. MM NichtWGebäude'!$S7*SQRT(AJ7)))))),0)","v":0},{"$f":"IF(AI7=0,0,\nIF((AI7-'Schadensrel. MM NichtWGebäude'!$N7)<=0,\n 0,\n IF(((AI7-'Schadensrel. MM NichtWGebäude'!$N7))>(IF(\n    ('Schadensrel. MM NichtWGebäude'!$J7+'Schadensrel. MM NichtWGebäude'!$K7)=0,\n     (Berechnungsgrundlagen!$I$20+Berechnungsgrundlagen!$I$21),\n     ('Schadensrel. MM NichtWGebäude'!$J7+'Schadensrel. MM NichtWGebäude'!$K7))),\n  IF(('Schadensrel. MM NichtWGebäude'!$J7+'Schadensrel. MM NichtWGebäude'!$K7)=0,\n   (Berechnungsgrundlagen!$I$20+Berechnungsgrundlagen!$I$21),\n   ('Schadensrel. MM NichtWGebäude'!$J7+'Schadensrel. MM NichtWGebäude'!$K7)),\n  ((AI7-'Schadensrel. MM NichtWGebäude'!$N7)))))","v":0},null,{"$f":"IF(AN7>0,'Schadensrel. MM NichtWGebäude'!$T7+(1000*'Schadensrel. MM NichtWGebäude'!$U7*SQRT(AN7)),IF(AM7=0,0,IF(AI7<='Schadensrel. MM NichtWGebäude'!$N7,0, 'Schadensrel. MM NichtWGebäude'!$T7+(1000*'Schadensrel. MM NichtWGebäude'!$U7*SQRT(AM7)))))","v":0},{"$f":"IF(AI7=0,\n 0,\n AI7-('Schadensrel. MM NichtWGebäude'!$N7+\n   IF(('Schadensrel. MM NichtWGebäude'!$J7+'Schadensrel. Merkmale WGebäude'!$K7)=0,\n    Berechnungsgrundlagen!$I$20+Berechnungsgrundlagen!$I$21,\n    'Schadensrel. MM NichtWGebäude'!$J7+'Schadensrel. MM NichtWGebäude'!$K7)))","v":0},null,{"$f":"IF(AQ7>0,\n 'Schadensrel. MM NichtWGebäude'!$V7+(1000*'Schadensrel. MM NichtWGebäude'!$X7*SQRT(AQ7)),\n IF(AI7<=('Schadensrel. MM NichtWGebäude'!N7+IF(\n    ('Schadensrel. MM NichtWGebäude'!$J7+'Schadensrel. MM NichtWGebäude'!$K7)=0,\n     Berechnungsgrundlagen!$I$20+Berechnungsgrundlagen!$I$21,\n     'Schadensrel. MM NichtWGebäude'!$J7+'Schadensrel. MM NichtWGebäude'!$K7)),\n  0,\n  ('Schadensrel. MM NichtWGebäude'!$V7+(1000*'Schadensrel. MM NichtWGebäude'!$X7*SQRT(AP7)))))","v":0},{"$f":"IF(AI7=0,0,'Schadensrel. MM NichtWGebäude'!$Y7)","v":0},null,{"$f":"SUM(AL7+AO7+AR7+AS7)*(IF($AI$5>50,1,IF(AT7=0,1,1-AT7)))","v":0},null,null,null,null,{"$f":"IF(AY7=0,\n 0,\n IF(('Schadensrel. MM NichtWGebäude'!H7+'Schadensrel. MM NichtWGebäude'!I7)=0,\n  (IF((Berechnungsgrundlagen!$I$18+Berechnungsgrundlagen!$I$19-'Schadensrel. MM NichtWGebäude'!$N7+$AY7)>(Berechnungsgrundlagen!$I$18+Berechnungsgrundlagen!$I$19),\n   (Berechnungsgrundlagen!$I$18+Berechnungsgrundlagen!$I$19),\n   (Berechnungsgrundlagen!$I$18+Berechnungsgrundlagen!$I$19-'Schadensrel. MM NichtWGebäude'!$N7+$AY7))),\n (IF(('Schadensrel. MM NichtWGebäude'!$H7+'Schadensrel. MM NichtWGebäude'!$I7-'Schadensrel. MM NichtWGebäude'!$N7+$AY7)>('Schadensrel. MM NichtWGebäude'!$H7+'Schadensrel. MM NichtWGebäude'!$I7),\n  ('Schadensrel. MM NichtWGebäude'!$H7+'Schadensrel. MM NichtWGebäude'!$I7),\n  ('Schadensrel. MM NichtWGebäude'!$H7+'Schadensrel. MM NichtWGebäude'!$I7-'Schadensrel. MM NichtWGebäude'!$N7+$AY7)))))","v":0},null,{"$f":"IF('Schadensrel. MM NichtWGebäude'!$F7=Berechnungsgrundlagen!$D$17,\n IF(BA7>0,\n  'Schadensrel. MM NichtWGebäude'!$R7+(1000*'Schadensrel. MM NichtWGebäude'!$S7*SQRT(BA7)),\n  IF(AZ7=0,\n   0,\n   IF('Schadensrel. MM NichtWGebäude'!$O7=Berechnungsgrundlagen!$D$18,\n    'Schadensrel. MM NichtWGebäude'!$R7+(1000*'Schadensrel. MM NichtWGebäude'!$S7*SQRT(AZ7)),\n     IF(AY7<='Schadensrel. MM NichtWGebäude'!$N7,\n      0,\n      'Schadensrel. MM NichtWGebäude'!$R7+(1000*'Schadensrel. MM NichtWGebäude'!$S7*SQRT(AZ7)))))),0)","v":0},{"$f":"IF(AY7=0,0,\nIF((AY7-'Schadensrel. MM NichtWGebäude'!$N7)<=0,\n 0,\n IF(((AY7-'Schadensrel. MM NichtWGebäude'!$N7))>(IF(\n    ('Schadensrel. MM NichtWGebäude'!$J7+'Schadensrel. MM NichtWGebäude'!$K7)=0,\n     (Berechnungsgrundlagen!$I$20+Berechnungsgrundlagen!$I$21),\n     ('Schadensrel. MM NichtWGebäude'!$J7+'Schadensrel. MM NichtWGebäude'!$K7))),\n  IF(('Schadensrel. MM NichtWGebäude'!$J7+'Schadensrel. MM NichtWGebäude'!$K7)=0,\n   (Berechnungsgrundlagen!$I$20+Berechnungsgrundlagen!$I$21),\n   ('Schadensrel. MM NichtWGebäude'!$J7+'Schadensrel. MM NichtWGebäude'!$K7)),\n  ((AY7-'Schadensrel. MM NichtWGebäude'!$N7)))))","v":0},null,{"$f":"IF(BD7>0,'Schadensrel. MM NichtWGebäude'!$T7+(1000*'Schadensrel. MM NichtWGebäude'!$U7*SQRT(BD7)),IF(BC7=0,0,IF(AY7<='Schadensrel. MM NichtWGebäude'!$N7,0, 'Schadensrel. MM NichtWGebäude'!$T7+(1000*'Schadensrel. MM NichtWGebäude'!$U7*SQRT(BC7)))))","v":0},{"$f":"IF(AY7=0,\n 0,\n AY7-('Schadensrel. MM NichtWGebäude'!$N7+\n   IF(('Schadensrel. MM NichtWGebäude'!$J7+'Schadensrel. Merkmale WGebäude'!$K7)=0,\n    Berechnungsgrundlagen!$I$20+Berechnungsgrundlagen!$I$21,\n    'Schadensrel. MM NichtWGebäude'!$J7+'Schadensrel. MM NichtWGebäude'!$K7)))","v":0},null,{"$f":"IF(BG7>0,\n 'Schadensrel. MM NichtWGebäude'!$V7+(1000*'Schadensrel. MM NichtWGebäude'!$X7*SQRT(BG7)),\n IF(AY7<=('Schadensrel. MM NichtWGebäude'!N7+IF(\n    ('Schadensrel. MM NichtWGebäude'!$J7+'Schadensrel. MM NichtWGebäude'!$K7)=0,\n     Berechnungsgrundlagen!$I$20+Berechnungsgrundlagen!$I$21,\n     'Schadensrel. MM NichtWGebäude'!$J7+'Schadensrel. MM NichtWGebäude'!$K7)),\n  0,\n  ('Schadensrel. MM NichtWGebäude'!$V7+(1000*'Schadensrel. MM NichtWGebäude'!$X7*SQRT(BF7)))))","v":0},{"$f":"IF(AY7=0,0,'Schadensrel. MM NichtWGebäude'!$Y7)","v":0},null,{"$f":"SUM(BB7+BE7+BH7+BI7)*(IF($AY$5>50,1,IF(BJ7=0,1,1-BJ7)))","v":0},null,null,null,null,{"$f":"IF(BO7=0,\n 0,\n IF(('Schadensrel. MM NichtWGebäude'!H7+'Schadensrel. MM NichtWGebäude'!I7)=0,\n  (IF((Berechnungsgrundlagen!$I$18+Berechnungsgrundlagen!$I$19-'Schadensrel. MM NichtWGebäude'!$N7+$BO7)>(Berechnungsgrundlagen!$I$18+Berechnungsgrundlagen!$I$19),\n   (Berechnungsgrundlagen!$I$18+Berechnungsgrundlagen!$I$19),\n   (Berechnungsgrundlagen!$I$18+Berechnungsgrundlagen!$I$19-'Schadensrel. MM NichtWGebäude'!$N7+$BO7))),\n (IF(('Schadensrel. MM NichtWGebäude'!$H7+'Schadensrel. MM NichtWGebäude'!$I7-'Schadensrel. MM NichtWGebäude'!$N7+$BO7)>('Schadensrel. MM NichtWGebäude'!$H7+'Schadensrel. MM NichtWGebäude'!$I7),\n  ('Schadensrel. MM NichtWGebäude'!$H7+'Schadensrel. MM NichtWGebäude'!$I7),\n  ('Schadensrel. MM NichtWGebäude'!$H7+'Schadensrel. MM NichtWGebäude'!$I7-'Schadensrel. MM NichtWGebäude'!$N7+$BO7)))))","v":0},null,{"$f":"IF('Schadensrel. MM NichtWGebäude'!$F7=Berechnungsgrundlagen!$D$17,\n IF(BQ7>0,\n  'Schadensrel. MM NichtWGebäude'!$R7+(1000*'Schadensrel. MM NichtWGebäude'!$S7*SQRT(BQ7)),\n  IF(BP7=0,\n   0,\n   IF('Schadensrel. MM NichtWGebäude'!$O7=Berechnungsgrundlagen!$D$18,\n    'Schadensrel. MM NichtWGebäude'!$R7+(1000*'Schadensrel. MM NichtWGebäude'!$S7*SQRT(BP7)),\n     IF(BO7<='Schadensrel. MM NichtWGebäude'!$N7,\n      0,\n      'Schadensrel. MM NichtWGebäude'!$R7+(1000*'Schadensrel. MM NichtWGebäude'!$S7*SQRT(BP7)))))),0)","v":0},{"$f":"IF(BO7=0,0,\nIF((BO7-'Schadensrel. MM NichtWGebäude'!$N7)<=0,\n 0,\n IF(((BO7-'Schadensrel. MM NichtWGebäude'!$N7))>(IF(\n    ('Schadensrel. MM NichtWGebäude'!$J7+'Schadensrel. MM NichtWGebäude'!$K7)=0,\n     (Berechnungsgrundlagen!$I$20+Berechnungsgrundlagen!$I$21),\n     ('Schadensrel. MM NichtWGebäude'!$J7+'Schadensrel. MM NichtWGebäude'!$K7))),\n  IF(('Schadensrel. MM NichtWGebäude'!$J7+'Schadensrel. MM NichtWGebäude'!$K7)=0,\n   (Berechnungsgrundlagen!$I$20+Berechnungsgrundlagen!$I$21),\n   ('Schadensrel. MM NichtWGebäude'!$J7+'Schadensrel. MM NichtWGebäude'!$K7)),\n  ((BO7-'Schadensrel. MM NichtWGebäude'!$N7)))))","v":0},null,{"$f":"IF(BT7>0,'Schadensrel. MM NichtWGebäude'!$T7+(1000*'Schadensrel. MM NichtWGebäude'!$U7*SQRT(BT7)),IF(BS7=0,0,IF(BO7<='Schadensrel. MM NichtWGebäude'!$N7,0, 'Schadensrel. MM NichtWGebäude'!$T7+(1000*'Schadensrel. MM NichtWGebäude'!$U7*SQRT(BS7)))))","v":0},{"$f":"IF(BO7=0,\n 0,\n BO7-('Schadensrel. MM NichtWGebäude'!$N7+\n   IF(('Schadensrel. MM NichtWGebäude'!$J7+'Schadensrel. Merkmale WGebäude'!$K7)=0,\n    Berechnungsgrundlagen!$I$20+Berechnungsgrundlagen!$I$21,\n    'Schadensrel. MM NichtWGebäude'!$J7+'Schadensrel. MM NichtWGebäude'!$K7)))","v":0},null,{"$f":"IF(BW7>0,\n 'Schadensrel. MM NichtWGebäude'!$V7+(1000*'Schadensrel. MM NichtWGebäude'!$X7*SQRT(BW7)),\n IF(BO7<=('Schadensrel. MM NichtWGebäude'!N7+IF(\n    ('Schadensrel. MM NichtWGebäude'!$J7+'Schadensrel. MM NichtWGebäude'!$K7)=0,\n     Berechnungsgrundlagen!$I$20+Berechnungsgrundlagen!$I$21,\n     'Schadensrel. MM NichtWGebäude'!$J7+'Schadensrel. MM NichtWGebäude'!$K7)),\n  0,\n  ('Schadensrel. MM NichtWGebäude'!$V7+(1000*'Schadensrel. MM NichtWGebäude'!$X7*SQRT(BV7)))))","v":0},{"$f":"IF(BO7=0,0,'Schadensrel. MM NichtWGebäude'!$Y7)","v":0},null,{"$f":"SUM(BR7+BU7+BX7+BY7)*(IF($BO$5>50,1,IF(BZ7=0,1,1-BZ7)))","v":0},null,null,null,null,{"$f":"IF(CE7=0,\n 0,\n IF(('Schadensrel. MM NichtWGebäude'!H7+'Schadensrel. MM NichtWGebäude'!I7)=0,\n  (IF((Berechnungsgrundlagen!$I$18+Berechnungsgrundlagen!$I$19-'Schadensrel. MM NichtWGebäude'!$N7+$CE7)>(Berechnungsgrundlagen!$I$18+Berechnungsgrundlagen!$I$19),\n   (Berechnungsgrundlagen!$I$18+Berechnungsgrundlagen!$I$19),\n   (Berechnungsgrundlagen!$I$18+Berechnungsgrundlagen!$I$19-'Schadensrel. MM NichtWGebäude'!$N7+$CE7))),\n (IF(('Schadensrel. MM NichtWGebäude'!$H7+'Schadensrel. MM NichtWGebäude'!$I7-'Schadensrel. MM NichtWGebäude'!$N7+$CE7)>('Schadensrel. MM NichtWGebäude'!$H7+'Schadensrel. MM NichtWGebäude'!$I7),\n  ('Schadensrel. MM NichtWGebäude'!$H7+'Schadensrel. MM NichtWGebäude'!$I7),\n  ('Schadensrel. MM NichtWGebäude'!$H7+'Schadensrel. MM NichtWGebäude'!$I7-'Schadensrel. MM NichtWGebäude'!$N7+$CE7)))))","v":0},null,{"$f":"IF('Schadensrel. MM NichtWGebäude'!$F7=Berechnungsgrundlagen!$D$17,\n IF(CG7>0,\n  'Schadensrel. MM NichtWGebäude'!$R7+(1000*'Schadensrel. MM NichtWGebäude'!$S7*SQRT(CG7)),\n  IF(CF7=0,\n   0,\n   IF('Schadensrel. MM NichtWGebäude'!$O7=Berechnungsgrundlagen!$D$18,\n    'Schadensrel. MM NichtWGebäude'!$R7+(1000*'Schadensrel. MM NichtWGebäude'!$S7*SQRT(CF7)),\n     IF(CE7<='Schadensrel. MM NichtWGebäude'!$N7,\n      0,\n      'Schadensrel. MM NichtWGebäude'!$R7+(1000*'Schadensrel. MM NichtWGebäude'!$S7*SQRT(CF7)))))),0)","v":0},{"$f":"IF(CE7=0,0,\nIF((CE7-'Schadensrel. MM NichtWGebäude'!$N7)<=0,\n 0,\n IF(((CE7-'Schadensrel. MM NichtWGebäude'!$N7))>(IF(\n    ('Schadensrel. MM NichtWGebäude'!$J7+'Schadensrel. MM NichtWGebäude'!$K7)=0,\n     (Berechnungsgrundlagen!$I$20+Berechnungsgrundlagen!$I$21),\n     ('Schadensrel. MM NichtWGebäude'!$J7+'Schadensrel. MM NichtWGebäude'!$K7))),\n  IF(('Schadensrel. MM NichtWGebäude'!$J7+'Schadensrel. MM NichtWGebäude'!$K7)=0,\n   (Berechnungsgrundlagen!$I$20+Berechnungsgrundlagen!$I$21),\n   ('Schadensrel. MM NichtWGebäude'!$J7+'Schadensrel. MM NichtWGebäude'!$K7)),\n  ((CE7-'Schadensrel. MM NichtWGebäude'!$N7)))))","v":0},null,{"$f":"IF(CJ7>0,'Schadensrel. MM NichtWGebäude'!$T7+(1000*'Schadensrel. MM NichtWGebäude'!$U7*SQRT(CJ7)),IF(CI7=0,0,IF(CE7<='Schadensrel. MM NichtWGebäude'!$N7,0, 'Schadensrel. MM NichtWGebäude'!$T7+(1000*'Schadensrel. MM NichtWGebäude'!$U7*SQRT(CI7)))))","v":0},{"$f":"IF(CE7=0,\n 0,\n CE7-('Schadensrel. MM NichtWGebäude'!$N7+\n   IF(('Schadensrel. MM NichtWGebäude'!$J7+'Schadensrel. Merkmale WGebäude'!$K7)=0,\n    Berechnungsgrundlagen!$I$20+Berechnungsgrundlagen!$I$21,\n    'Schadensrel. MM NichtWGebäude'!$J7+'Schadensrel. MM NichtWGebäude'!$K7)))","v":0},null,{"$f":"IF(CM7>0,\n 'Schadensrel. MM NichtWGebäude'!$V7+(1000*'Schadensrel. MM NichtWGebäude'!$X7*SQRT(CM7)),\n IF(CE7<=('Schadensrel. MM NichtWGebäude'!N7+IF(\n    ('Schadensrel. MM NichtWGebäude'!$J7+'Schadensrel. MM NichtWGebäude'!$K7)=0,\n     Berechnungsgrundlagen!$I$20+Berechnungsgrundlagen!$I$21,\n     'Schadensrel. MM NichtWGebäude'!$J7+'Schadensrel. MM NichtWGebäude'!$K7)),\n  0,\n  ('Schadensrel. MM NichtWGebäude'!$V7+(1000*'Schadensrel. MM NichtWGebäude'!$X7*SQRT(CL7)))))","v":0},{"$f":"IF(CE7=0,0,'Schadensrel. MM NichtWGebäude'!$Y7)","v":0},null,{"$f":"SUM(CH7+CK7+CN7+CO7)*(IF($CE$5>50,1,IF(CP7=0,1,1-CP7)))","v":0},null,null,null,null,{"$f":"IF(CU7=0,\n 0,\n IF(('Schadensrel. MM NichtWGebäude'!H7+'Schadensrel. MM NichtWGebäude'!I7)=0,\n  (IF((Berechnungsgrundlagen!$I$18+Berechnungsgrundlagen!$I$19-'Schadensrel. MM NichtWGebäude'!$N7+$CU7)>(Berechnungsgrundlagen!$I$18+Berechnungsgrundlagen!$I$19),\n   (Berechnungsgrundlagen!$I$18+Berechnungsgrundlagen!$I$19),\n   (Berechnungsgrundlagen!$I$18+Berechnungsgrundlagen!$I$19-'Schadensrel. MM NichtWGebäude'!$N7+$CU7))),\n (IF(('Schadensrel. MM NichtWGebäude'!$H7+'Schadensrel. MM NichtWGebäude'!$I7-'Schadensrel. MM NichtWGebäude'!$N7+$CU7)>('Schadensrel. MM NichtWGebäude'!$H7+'Schadensrel. MM NichtWGebäude'!$I7),\n  ('Schadensrel. MM NichtWGebäude'!$H7+'Schadensrel. MM NichtWGebäude'!$I7),\n  ('Schadensrel. MM NichtWGebäude'!$H7+'Schadensrel. MM NichtWGebäude'!$I7-'Schadensrel. MM NichtWGebäude'!$N7+$CU7)))))","v":0},null,{"$f":"IF('Schadensrel. MM NichtWGebäude'!$F7=Berechnungsgrundlagen!$D$17,\n IF(CW7>0,\n  'Schadensrel. MM NichtWGebäude'!$R7+(1000*'Schadensrel. MM NichtWGebäude'!$S7*SQRT(CW7)),\n  IF(CV7=0,\n   0,\n   IF('Schadensrel. MM NichtWGebäude'!$O7=Berechnungsgrundlagen!$D$18,\n    'Schadensrel. MM NichtWGebäude'!$R7+(1000*'Schadensrel. MM NichtWGebäude'!$S7*SQRT(CV7)),\n     IF(CU7<='Schadensrel. MM NichtWGebäude'!$N7,\n      0,\n      'Schadensrel. MM NichtWGebäude'!$R7+(1000*'Schadensrel. MM NichtWGebäude'!$S7*SQRT(CV7)))))),0)","v":0},{"$f":"IF(CU7=0,0,\nIF((CU7-'Schadensrel. MM NichtWGebäude'!$N7)<=0,\n 0,\n IF(((CU7-'Schadensrel. MM NichtWGebäude'!$N7))>(IF(\n    ('Schadensrel. MM NichtWGebäude'!$J7+'Schadensrel. MM NichtWGebäude'!$K7)=0,\n     (Berechnungsgrundlagen!$I$20+Berechnungsgrundlagen!$I$21),\n     ('Schadensrel. MM NichtWGebäude'!$J7+'Schadensrel. MM NichtWGebäude'!$K7))),\n  IF(('Schadensrel. MM NichtWGebäude'!$J7+'Schadensrel. MM NichtWGebäude'!$K7)=0,\n   (Berechnungsgrundlagen!$I$20+Berechnungsgrundlagen!$I$21),\n   ('Schadensrel. MM NichtWGebäude'!$J7+'Schadensrel. MM NichtWGebäude'!$K7)),\n  ((CU7-'Schadensrel. MM NichtWGebäude'!$N7)))))","v":0},null,{"$f":"IF(CZ7>0,'Schadensrel. MM NichtWGebäude'!$T7+(1000*'Schadensrel. MM NichtWGebäude'!$U7*SQRT(CZ7)),IF(CY7=0,0,IF(CU7<='Schadensrel. MM NichtWGebäude'!$N7,0, 'Schadensrel. MM NichtWGebäude'!$T7+(1000*'Schadensrel. MM NichtWGebäude'!$U7*SQRT(CY7)))))","v":0},{"$f":"IF(CU7=0,\n 0,\n CU7-('Schadensrel. MM NichtWGebäude'!$N7+\n   IF(('Schadensrel. MM NichtWGebäude'!$J7+'Schadensrel. Merkmale WGebäude'!$K7)=0,\n    Berechnungsgrundlagen!$I$20+Berechnungsgrundlagen!$I$21,\n    'Schadensrel. MM NichtWGebäude'!$J7+'Schadensrel. MM NichtWGebäude'!$K7)))","v":0},null,{"$f":"IF(DC7>0,\n 'Schadensrel. MM NichtWGebäude'!$V7+(1000*'Schadensrel. MM NichtWGebäude'!$X7*SQRT(DC7)),\n IF(CU7<=('Schadensrel. MM NichtWGebäude'!N7+IF(\n    ('Schadensrel. MM NichtWGebäude'!$J7+'Schadensrel. MM NichtWGebäude'!$K7)=0,\n     Berechnungsgrundlagen!$I$20+Berechnungsgrundlagen!$I$21,\n     'Schadensrel. MM NichtWGebäude'!$J7+'Schadensrel. MM NichtWGebäude'!$K7)),\n  0,\n  ('Schadensrel. MM NichtWGebäude'!$V7+(1000*'Schadensrel. MM NichtWGebäude'!$X7*SQRT(DB7)))))","v":0},{"$f":"IF(CU7=0,0,'Schadensrel. MM NichtWGebäude'!$Y7)","v":0},null,{"$f":"SUM(CX7+DA7+DD7+DE7)*(IF($CU$5>50,1,IF(DF7=0,1,1-DF7)))","v":0}]
[{"$f":"IF('Schadensrel. MM NichtWGebäude'!B8=\"\",\"\",'Schadensrel. MM NichtWGebäude'!B8)","v":""},"Beherbergung und Gastronomie (I)",null,{"$f":"IF(C8=0,0,IF(('Schadensrel. MM NichtWGebäude'!H8+'Schadensrel. MM NichtWGebäude'!I8)=0,(IF((Berechnungsgrundlagen!$I$18+Berechnungsgrundlagen!$I$19-'Schadensrel. MM NichtWGebäude'!$N8+C8)>(Berechnungsgrundlagen!$I$18+Berechnungsgrundlagen!$I$19),(Berechnungsgrundlagen!$I$18+Berechnungsgrundlagen!$I$19),(Berechnungsgrundlagen!$I$18+Berechnungsgrundlagen!$I$19-'Schadensrel. MM NichtWGebäude'!$N8+C8))),(IF(('Schadensrel. MM NichtWGebäude'!$H8+'Schadensrel. MM NichtWGebäude'!$I8-'Schadensrel. MM NichtWGebäude'!$N8+C8)>('Schadensrel. MM NichtWGebäude'!$H8+'Schadensrel. MM NichtWGebäude'!$I8),('Schadensrel. MM NichtWGebäude'!$H8+'Schadensrel. MM NichtWGebäude'!$I8),('Schadensrel. MM NichtWGebäude'!$H8+'Schadensrel. MM NichtWGebäude'!$I8-'Schadensrel. MM NichtWGebäude'!$N8+C8)))))","v":0},null,{"$f":"IF('Schadensrel. MM NichtWGebäude'!$F8=Berechnungsgrundlagen!$D$17,\n IF(E8>0,\n  'Schadensrel. MM NichtWGebäude'!$R8+(1000*'Schadensrel. MM NichtWGebäude'!$S8*SQRT(E8)),\n  IF(D8=0,\n   0,\n   IF('Schadensrel. MM NichtWGebäude'!$O8=Berechnungsgrundlagen!$D$18,\n    'Schadensrel. MM NichtWGebäude'!$R8+(1000*'Schadensrel. MM NichtWGebäude'!$S8*SQRT(D8)),\n     IF(C8<='Schadensrel. MM NichtWGebäude'!$N8,\n      0,\n      'Schadensrel. MM NichtWGebäude'!$R8+(1000*'Schadensrel. MM NichtWGebäude'!$S8*SQRT(D8)))))),0)","v":0},{"$f":"IF(C8=0,0,\nIF((C8-'Schadensrel. MM NichtWGebäude'!$N8)<=0,\n 0,\n IF(((C8-'Schadensrel. MM NichtWGebäude'!$N8))>(IF(\n    ('Schadensrel. MM NichtWGebäude'!$J8+'Schadensrel. MM NichtWGebäude'!$K8)=0,\n     (Berechnungsgrundlagen!$I$20+Berechnungsgrundlagen!$I$21),\n     ('Schadensrel. MM NichtWGebäude'!$J8+'Schadensrel. MM NichtWGebäude'!$K8))),\n  IF(('Schadensrel. MM NichtWGebäude'!$J8+'Schadensrel. MM NichtWGebäude'!$K8)=0,\n   (Berechnungsgrundlagen!$I$20+Berechnungsgrundlagen!$I$21),\n   ('Schadensrel. MM NichtWGebäude'!$J8+'Schadensrel. MM NichtWGebäude'!$K8)),\n  ((C8-'Schadensrel. MM NichtWGebäude'!$N8)))))","v":0},null,{"$f":"IF(H8>0,'Schadensrel. MM NichtWGebäude'!$T8+(1000*'Schadensrel. MM NichtWGebäude'!$U8*SQRT(H8)),IF(G8=0,0,IF(C8<='Schadensrel. MM NichtWGebäude'!$N8,0, 'Schadensrel. MM NichtWGebäude'!$T8+(1000*'Schadensrel. MM NichtWGebäude'!$U8*SQRT(G8)))))","v":0},{"$f":"IF(C8=0,\n 0,\n C8-('Schadensrel. MM NichtWGebäude'!$N8+\n   IF(('Schadensrel. MM NichtWGebäude'!$J8+'Schadensrel. Merkmale WGebäude'!$K21)=0,\n    Berechnungsgrundlagen!$I$20+Berechnungsgrundlagen!$I$21,\n    'Schadensrel. MM NichtWGebäude'!$J8+'Schadensrel. MM NichtWGebäude'!$K8)))","v":0},null,{"$f":"IF(K8>0,\n 'Schadensrel. MM NichtWGebäude'!$V8+(1000*'Schadensrel. MM NichtWGebäude'!$X8*SQRT(K8)),\n IF(C8<=('Schadensrel. MM NichtWGebäude'!N8+IF(\n    ('Schadensrel. MM NichtWGebäude'!$J8+'Schadensrel. MM NichtWGebäude'!$K8)=0,\n     Berechnungsgrundlagen!$I$20+Berechnungsgrundlagen!$I$21,\n     'Schadensrel. MM NichtWGebäude'!$J8+'Schadensrel. MM NichtWGebäude'!$K8)),\n  0,\n  ('Schadensrel. MM NichtWGebäude'!$V8+(1000*'Schadensrel. MM NichtWGebäude'!$X8*SQRT(J8)))))","v":0},{"$f":"IF(C8=0,0,'Schadensrel. MM NichtWGebäude'!$Y8)","v":0},null,{"$f":"SUM(F8+I8+L8+M8)*(IF($C$5>50,1,IF(N8=0,1,1-N8)))","v":0},null,null,null,null,{"$f":"IF(S8=0,0,IF(('Schadensrel. MM NichtWGebäude'!H8+'Schadensrel. MM NichtWGebäude'!I8)=0,(IF((Berechnungsgrundlagen!$I$18+Berechnungsgrundlagen!$I$19-'Schadensrel. MM NichtWGebäude'!$N8+$S8)>(Berechnungsgrundlagen!$I$18+Berechnungsgrundlagen!$I$19),(Berechnungsgrundlagen!$I$18+Berechnungsgrundlagen!$I$19),(Berechnungsgrundlagen!$I$18+Berechnungsgrundlagen!$I$19-'Schadensrel. MM NichtWGebäude'!$N8+$S8))),(IF(('Schadensrel. MM NichtWGebäude'!$H8+'Schadensrel. MM NichtWGebäude'!$I8-'Schadensrel. MM NichtWGebäude'!$N8+$S8)>('Schadensrel. MM NichtWGebäude'!$H8+'Schadensrel. MM NichtWGebäude'!$I8),('Schadensrel. MM NichtWGebäude'!$H8+'Schadensrel. MM NichtWGebäude'!$I8),('Schadensrel. MM NichtWGebäude'!$H8+'Schadensrel. MM NichtWGebäude'!$I8-'Schadensrel. MM NichtWGebäude'!$N8+$S8)))))","v":0},null,{"$f":"IF('Schadensrel. MM NichtWGebäude'!$F8=Berechnungsgrundlagen!$D$17,\n IF(U8>0,\n  'Schadensrel. MM NichtWGebäude'!$R8+(1000*'Schadensrel. MM NichtWGebäude'!$S8*SQRT(U8)),\n  IF(T8=0,\n   0,\n   IF('Schadensrel. MM NichtWGebäude'!$O8=Berechnungsgrundlagen!$D$18,\n    'Schadensrel. MM NichtWGebäude'!$R8+(1000*'Schadensrel. MM NichtWGebäude'!$S8*SQRT(T8)),\n     IF(S8<='Schadensrel. MM NichtWGebäude'!$N8,\n      0,\n      'Schadensrel. MM NichtWGebäude'!$R8+(1000*'Schadensrel. MM NichtWGebäude'!$S8*SQRT(T8)))))),0)","v":0},{"$f":"IF(S8=0,0,\nIF((S8-'Schadensrel. MM NichtWGebäude'!$N8)<=0,\n 0,\n IF(((S8-'Schadensrel. MM NichtWGebäude'!$N8))>(IF(\n    ('Schadensrel. MM NichtWGebäude'!$J8+'Schadensrel. MM NichtWGebäude'!$K8)=0,\n     (Berechnungsgrundlagen!$I$20+Berechnungsgrundlagen!$I$21),\n     ('Schadensrel. MM NichtWGebäude'!$J8+'Schadensrel. MM NichtWGebäude'!$K8))),\n  IF(('Schadensrel. MM NichtWGebäude'!$J8+'Schadensrel. MM NichtWGebäude'!$K8)=0,\n   (Berechnungsgrundlagen!$I$20+Berechnungsgrundlagen!$I$21),\n   ('Schadensrel. MM NichtWGebäude'!$J8+'Schadensrel. MM NichtWGebäude'!$K8)),\n  ((S8-'Schadensrel. MM NichtWGebäude'!$N8)))))","v":0},null,{"$f":"IF(X8>0,'Schadensrel. MM NichtWGebäude'!$T8+(1000*'Schadensrel. MM NichtWGebäude'!$U8*SQRT(X8)),IF(W8=0,0,IF(S8<='Schadensrel. MM NichtWGebäude'!$N8,0, 'Schadensrel. MM NichtWGebäude'!$T8+(1000*'Schadensrel. MM NichtWGebäude'!$U8*SQRT(W8)))))","v":0},{"$f":"IF(S8=0,\n 0,\n S8-('Schadensrel. MM NichtWGebäude'!$N8+\n   IF(('Schadensrel. MM NichtWGebäude'!$J8+'Schadensrel. Merkmale WGebäude'!$K21)=0,\n    Berechnungsgrundlagen!$I$20+Berechnungsgrundlagen!$I$21,\n    'Schadensrel. MM NichtWGebäude'!$J8+'Schadensrel. MM NichtWGebäude'!$K8)))","v":0},null,{"$f":"IF(AA8>0,\n 'Schadensrel. MM NichtWGebäude'!$V8+(1000*'Schadensrel. MM NichtWGebäude'!$X8*SQRT(AA8)),\n IF(S8<=('Schadensrel. MM NichtWGebäude'!N8+IF(\n    ('Schadensrel. MM NichtWGebäude'!$J8+'Schadensrel. MM NichtWGebäude'!$K8)=0,\n     Berechnungsgrundlagen!$I$20+Berechnungsgrundlagen!$I$21,\n     'Schadensrel. MM NichtWGebäude'!$J8+'Schadensrel. MM NichtWGebäude'!$K8)),\n  0,\n  ('Schadensrel. MM NichtWGebäude'!$V8+(1000*'Schadensrel. MM NichtWGebäude'!$X8*SQRT(Z8)))))","v":0},{"$f":"IF(S8=0,0,'Schadensrel. MM NichtWGebäude'!$Y8)","v":0},null,{"$f":"SUM(V8+Y8+AB8+AC8)*(IF($S$5>50,1,IF(AD8=0,1,1-AD8)))","v":0},null,null,null,null,{"$f":"IF(AI8=0,\n 0,\n IF(('Schadensrel. MM NichtWGebäude'!H8+'Schadensrel. MM NichtWGebäude'!I8)=0,\n  (IF((Berechnungsgrundlagen!$I$18+Berechnungsgrundlagen!$I$19-'Schadensrel. MM NichtWGebäude'!$N8+$AI8)>(Berechnungsgrundlagen!$I$18+Berechnungsgrundlagen!$I$19),\n   (Berechnungsgrundlagen!$I$18+Berechnungsgrundlagen!$I$19),\n   (Berechnungsgrundlagen!$I$18+Berechnungsgrundlagen!$I$19-'Schadensrel. MM NichtWGebäude'!$N8+$AI8))),\n (IF(('Schadensrel. MM NichtWGebäude'!$H8+'Schadensrel. MM NichtWGebäude'!$I8-'Schadensrel. MM NichtWGebäude'!$N8+$AI8)>('Schadensrel. MM NichtWGebäude'!$H8+'Schadensrel. MM NichtWGebäude'!$I8),\n  ('Schadensrel. MM NichtWGebäude'!$H8+'Schadensrel. MM NichtWGebäude'!$I8),\n  ('Schadensrel. MM NichtWGebäude'!$H8+'Schadensrel. MM NichtWGebäude'!$I8-'Schadensrel. MM NichtWGebäude'!$N8+$AI8)))))","v":0},null,{"$f":"IF('Schadensrel. MM NichtWGebäude'!$F8=Berechnungsgrundlagen!$D$17,\n IF(AK8>0,\n  'Schadensrel. MM NichtWGebäude'!$R8+(1000*'Schadensrel. MM NichtWGebäude'!$S8*SQRT(AK8)),\n  IF(AJ8=0,\n   0,\n   IF('Schadensrel. MM NichtWGebäude'!$O8=Berechnungsgrundlagen!$D$18,\n    'Schadensrel. MM NichtWGebäude'!$R8+(1000*'Schadensrel. MM NichtWGebäude'!$S8*SQRT(AJ8)),\n     IF(AI8<='Schadensrel. MM NichtWGebäude'!$N8,\n      0,\n      'Schadensrel. MM NichtWGebäude'!$R8+(1000*'Schadensrel. MM NichtWGebäude'!$S8*SQRT(AJ8)))))),0)","v":0},{"$f":"IF(AI8=0,0,\nIF((AI8-'Schadensrel. MM NichtWGebäude'!$N8)<=0,\n 0,\n IF(((AI8-'Schadensrel. MM NichtWGebäude'!$N8))>(IF(\n    ('Schadensrel. MM NichtWGebäude'!$J8+'Schadensrel. MM NichtWGebäude'!$K8)=0,\n     (Berechnungsgrundlagen!$I$20+Berechnungsgrundlagen!$I$21),\n     ('Schadensrel. MM NichtWGebäude'!$J8+'Schadensrel. MM NichtWGebäude'!$K8))),\n  IF(('Schadensrel. MM NichtWGebäude'!$J8+'Schadensrel. MM NichtWGebäude'!$K8)=0,\n   (Berechnungsgrundlagen!$I$20+Berechnungsgrundlagen!$I$21),\n   ('Schadensrel. MM NichtWGebäude'!$J8+'Schadensrel. MM NichtWGebäude'!$K8)),\n  ((AI8-'Schadensrel. MM NichtWGebäude'!$N8)))))","v":0},null,{"$f":"IF(AN8>0,'Schadensrel. MM NichtWGebäude'!$T8+(1000*'Schadensrel. MM NichtWGebäude'!$U8*SQRT(AN8)),IF(AM8=0,0,IF(AI8<='Schadensrel. MM NichtWGebäude'!$N8,0, 'Schadensrel. MM NichtWGebäude'!$T8+(1000*'Schadensrel. MM NichtWGebäude'!$U8*SQRT(AM8)))))","v":0},{"$f":"IF(AI8=0,\n 0,\n AI8-('Schadensrel. MM NichtWGebäude'!$N8+\n   IF(('Schadensrel. MM NichtWGebäude'!$J8+'Schadensrel. Merkmale WGebäude'!$K8)=0,\n    Berechnungsgrundlagen!$I$20+Berechnungsgrundlagen!$I$21,\n    'Schadensrel. MM NichtWGebäude'!$J8+'Schadensrel. MM NichtWGebäude'!$K8)))","v":0},null,{"$f":"IF(AQ8>0,\n 'Schadensrel. MM NichtWGebäude'!$V8+(1000*'Schadensrel. MM NichtWGebäude'!$X8*SQRT(AQ8)),\n IF(AI8<=('Schadensrel. MM NichtWGebäude'!N8+IF(\n    ('Schadensrel. MM NichtWGebäude'!$J8+'Schadensrel. MM NichtWGebäude'!$K8)=0,\n     Berechnungsgrundlagen!$I$20+Berechnungsgrundlagen!$I$21,\n     'Schadensrel. MM NichtWGebäude'!$J8+'Schadensrel. MM NichtWGebäude'!$K8)),\n  0,\n  ('Schadensrel. MM NichtWGebäude'!$V8+(1000*'Schadensrel. MM NichtWGebäude'!$X8*SQRT(AP8)))))","v":0},{"$f":"IF(AI8=0,0,'Schadensrel. MM NichtWGebäude'!$Y8)","v":0},null,{"$f":"SUM(AL8+AO8+AR8+AS8)*(IF($AI$5>50,1,IF(AT8=0,1,1-AT8)))","v":0},null,null,null,null,{"$f":"IF(AY8=0,\n 0,\n IF(('Schadensrel. MM NichtWGebäude'!H8+'Schadensrel. MM NichtWGebäude'!I8)=0,\n  (IF((Berechnungsgrundlagen!$I$18+Berechnungsgrundlagen!$I$19-'Schadensrel. MM NichtWGebäude'!$N8+$AY8)>(Berechnungsgrundlagen!$I$18+Berechnungsgrundlagen!$I$19),\n   (Berechnungsgrundlagen!$I$18+Berechnungsgrundlagen!$I$19),\n   (Berechnungsgrundlagen!$I$18+Berechnungsgrundlagen!$I$19-'Schadensrel. MM NichtWGebäude'!$N8+$AY8))),\n (IF(('Schadensrel. MM NichtWGebäude'!$H8+'Schadensrel. MM NichtWGebäude'!$I8-'Schadensrel. MM NichtWGebäude'!$N8+$AY8)>('Schadensrel. MM NichtWGebäude'!$H8+'Schadensrel. MM NichtWGebäude'!$I8),\n  ('Schadensrel. MM NichtWGebäude'!$H8+'Schadensrel. MM NichtWGebäude'!$I8),\n  ('Schadensrel. MM NichtWGebäude'!$H8+'Schadensrel. MM NichtWGebäude'!$I8-'Schadensrel. MM NichtWGebäude'!$N8+$AY8)))))","v":0},null,{"$f":"IF('Schadensrel. MM NichtWGebäude'!$F8=Berechnungsgrundlagen!$D$17,\n IF(BA8>0,\n  'Schadensrel. MM NichtWGebäude'!$R8+(1000*'Schadensrel. MM NichtWGebäude'!$S8*SQRT(BA8)),\n  IF(AZ8=0,\n   0,\n   IF('Schadensrel. MM NichtWGebäude'!$O8=Berechnungsgrundlagen!$D$18,\n    'Schadensrel. MM NichtWGebäude'!$R8+(1000*'Schadensrel. MM NichtWGebäude'!$S8*SQRT(AZ8)),\n     IF(AY8<='Schadensrel. MM NichtWGebäude'!$N8,\n      0,\n      'Schadensrel. MM NichtWGebäude'!$R8+(1000*'Schadensrel. MM NichtWGebäude'!$S8*SQRT(AZ8)))))),0)","v":0},{"$f":"IF(AY8=0,0,\nIF((AY8-'Schadensrel. MM NichtWGebäude'!$N8)<=0,\n 0,\n IF(((AY8-'Schadensrel. MM NichtWGebäude'!$N8))>(IF(\n    ('Schadensrel. MM NichtWGebäude'!$J8+'Schadensrel. MM NichtWGebäude'!$K8)=0,\n     (Berechnungsgrundlagen!$I$20+Berechnungsgrundlagen!$I$21),\n     ('Schadensrel. MM NichtWGebäude'!$J8+'Schadensrel. MM NichtWGebäude'!$K8))),\n  IF(('Schadensrel. MM NichtWGebäude'!$J8+'Schadensrel. MM NichtWGebäude'!$K8)=0,\n   (Berechnungsgrundlagen!$I$20+Berechnungsgrundlagen!$I$21),\n   ('Schadensrel. MM NichtWGebäude'!$J8+'Schadensrel. MM NichtWGebäude'!$K8)),\n  ((AY8-'Schadensrel. MM NichtWGebäude'!$N8)))))","v":0},null,{"$f":"IF(BD8>0,'Schadensrel. MM NichtWGebäude'!$T8+(1000*'Schadensrel. MM NichtWGebäude'!$U8*SQRT(BD8)),IF(BC8=0,0,IF(AY8<='Schadensrel. MM NichtWGebäude'!$N8,0, 'Schadensrel. MM NichtWGebäude'!$T8+(1000*'Schadensrel. MM NichtWGebäude'!$U8*SQRT(BC8)))))","v":0},{"$f":"IF(AY8=0,\n 0,\n AY8-('Schadensrel. MM NichtWGebäude'!$N8+\n   IF(('Schadensrel. MM NichtWGebäude'!$J8+'Schadensrel. Merkmale WGebäude'!$K21)=0,\n    Berechnungsgrundlagen!$I$20+Berechnungsgrundlagen!$I$21,\n    'Schadensrel. MM NichtWGebäude'!$J8+'Schadensrel. MM NichtWGebäude'!$K8)))","v":0},null,{"$f":"IF(BG8>0,\n 'Schadensrel. MM NichtWGebäude'!$V8+(1000*'Schadensrel. MM NichtWGebäude'!$X8*SQRT(BG8)),\n IF(AY8<=('Schadensrel. MM NichtWGebäude'!N8+IF(\n    ('Schadensrel. MM NichtWGebäude'!$J8+'Schadensrel. MM NichtWGebäude'!$K8)=0,\n     Berechnungsgrundlagen!$I$20+Berechnungsgrundlagen!$I$21,\n     'Schadensrel. MM NichtWGebäude'!$J8+'Schadensrel. MM NichtWGebäude'!$K8)),\n  0,\n  ('Schadensrel. MM NichtWGebäude'!$V8+(1000*'Schadensrel. MM NichtWGebäude'!$X8*SQRT(BF8)))))","v":0},{"$f":"IF(AY8=0,0,'Schadensrel. MM NichtWGebäude'!$Y8)","v":0},null,{"$f":"SUM(BB8+BE8+BH8+BI8)*(IF($AY$5>50,1,IF(BJ8=0,1,1-BJ8)))","v":0},null,null,null,null,{"$f":"IF(BO8=0,\n 0,\n IF(('Schadensrel. MM NichtWGebäude'!H8+'Schadensrel. MM NichtWGebäude'!I8)=0,\n  (IF((Berechnungsgrundlagen!$I$18+Berechnungsgrundlagen!$I$19-'Schadensrel. MM NichtWGebäude'!$N8+$BO8)>(Berechnungsgrundlagen!$I$18+Berechnungsgrundlagen!$I$19),\n   (Berechnungsgrundlagen!$I$18+Berechnungsgrundlagen!$I$19),\n   (Berechnungsgrundlagen!$I$18+Berechnungsgrundlagen!$I$19-'Schadensrel. MM NichtWGebäude'!$N8+$BO8))),\n (IF(('Schadensrel. MM NichtWGebäude'!$H8+'Schadensrel. MM NichtWGebäude'!$I8-'Schadensrel. MM NichtWGebäude'!$N8+$BO8)>('Schadensrel. MM NichtWGebäude'!$H8+'Schadensrel. MM NichtWGebäude'!$I8),\n  ('Schadensrel. MM NichtWGebäude'!$H8+'Schadensrel. MM NichtWGebäude'!$I8),\n  ('Schadensrel. MM NichtWGebäude'!$H8+'Schadensrel. MM NichtWGebäude'!$I8-'Schadensrel. MM NichtWGebäude'!$N8+$BO8)))))","v":0},null,{"$f":"IF('Schadensrel. MM NichtWGebäude'!$F8=Berechnungsgrundlagen!$D$17,\n IF(BQ8>0,\n  'Schadensrel. MM NichtWGebäude'!$R8+(1000*'Schadensrel. MM NichtWGebäude'!$S8*SQRT(BQ8)),\n  IF(BP8=0,\n   0,\n   IF('Schadensrel. MM NichtWGebäude'!$O8=Berechnungsgrundlagen!$D$18,\n    'Schadensrel. MM NichtWGebäude'!$R8+(1000*'Schadensrel. MM NichtWGebäude'!$S8*SQRT(BP8)),\n     IF(BO8<='Schadensrel. MM NichtWGebäude'!$N8,\n      0,\n      'Schadensrel. MM NichtWGebäude'!$R8+(1000*'Schadensrel. MM NichtWGebäude'!$S8*SQRT(BP8)))))),0)","v":0},{"$f":"IF(BO8=0,0,\nIF((BO8-'Schadensrel. MM NichtWGebäude'!$N8)<=0,\n 0,\n IF(((BO8-'Schadensrel. MM NichtWGebäude'!$N8))>(IF(\n    ('Schadensrel. MM NichtWGebäude'!$J8+'Schadensrel. MM NichtWGebäude'!$K8)=0,\n     (Berechnungsgrundlagen!$I$20+Berechnungsgrundlagen!$I$21),\n     ('Schadensrel. MM NichtWGebäude'!$J8+'Schadensrel. MM NichtWGebäude'!$K8))),\n  IF(('Schadensrel. MM NichtWGebäude'!$J8+'Schadensrel. MM NichtWGebäude'!$K8)=0,\n   (Berechnungsgrundlagen!$I$20+Berechnungsgrundlagen!$I$21),\n   ('Schadensrel. MM NichtWGebäude'!$J8+'Schadensrel. MM NichtWGebäude'!$K8)),\n  ((BO8-'Schadensrel. MM NichtWGebäude'!$N8)))))","v":0},null,{"$f":"IF(BT8>0,'Schadensrel. MM NichtWGebäude'!$T8+(1000*'Schadensrel. MM NichtWGebäude'!$U8*SQRT(BT8)),IF(BS8=0,0,IF(BO8<='Schadensrel. MM NichtWGebäude'!$N8,0, 'Schadensrel. MM NichtWGebäude'!$T8+(1000*'Schadensrel. MM NichtWGebäude'!$U8*SQRT(BS8)))))","v":0},{"$f":"IF(BO8=0,\n 0,\n BO8-('Schadensrel. MM NichtWGebäude'!$N8+\n   IF(('Schadensrel. MM NichtWGebäude'!$J8+'Schadensrel. Merkmale WGebäude'!$K21)=0,\n    Berechnungsgrundlagen!$I$20+Berechnungsgrundlagen!$I$21,\n    'Schadensrel. MM NichtWGebäude'!$J8+'Schadensrel. MM NichtWGebäude'!$K8)))","v":0},null,{"$f":"IF(BW8>0,\n 'Schadensrel. MM NichtWGebäude'!$V8+(1000*'Schadensrel. MM NichtWGebäude'!$X8*SQRT(BW8)),\n IF(BO8<=('Schadensrel. MM NichtWGebäude'!N8+IF(\n    ('Schadensrel. MM NichtWGebäude'!$J8+'Schadensrel. MM NichtWGebäude'!$K8)=0,\n     Berechnungsgrundlagen!$I$20+Berechnungsgrundlagen!$I$21,\n     'Schadensrel. MM NichtWGebäude'!$J8+'Schadensrel. MM NichtWGebäude'!$K8)),\n  0,\n  ('Schadensrel. MM NichtWGebäude'!$V8+(1000*'Schadensrel. MM NichtWGebäude'!$X8*SQRT(BV8)))))","v":0},{"$f":"IF(BO8=0,0,'Schadensrel. MM NichtWGebäude'!$Y8)","v":0},null,{"$f":"SUM(BR8+BU8+BX8+BY8)*(IF($BO$5>50,1,IF(BZ8=0,1,1-BZ8)))","v":0},null,null,null,null,{"$f":"IF(CE8=0,\n 0,\n IF(('Schadensrel. MM NichtWGebäude'!H8+'Schadensrel. MM NichtWGebäude'!I8)=0,\n  (IF((Berechnungsgrundlagen!$I$18+Berechnungsgrundlagen!$I$19-'Schadensrel. MM NichtWGebäude'!$N8+$CE8)>(Berechnungsgrundlagen!$I$18+Berechnungsgrundlagen!$I$19),\n   (Berechnungsgrundlagen!$I$18+Berechnungsgrundlagen!$I$19),\n   (Berechnungsgrundlagen!$I$18+Berechnungsgrundlagen!$I$19-'Schadensrel. MM NichtWGebäude'!$N8+$CE8))),\n (IF(('Schadensrel. MM NichtWGebäude'!$H8+'Schadensrel. MM NichtWGebäude'!$I8-'Schadensrel. MM NichtWGebäude'!$N8+$CE8)>('Schadensrel. MM NichtWGebäude'!$H8+'Schadensrel. MM NichtWGebäude'!$I8),\n  ('Schadensrel. MM NichtWGebäude'!$H8+'Schadensrel. MM NichtWGebäude'!$I8),\n  ('Schadensrel. MM NichtWGebäude'!$H8+'Schadensrel. MM NichtWGebäude'!$I8-'Schadensrel. MM NichtWGebäude'!$N8+$CE8)))))","v":0},null,{"$f":"IF('Schadensrel. MM NichtWGebäude'!$F8=Berechnungsgrundlagen!$D$17,\n IF(CG8>0,\n  'Schadensrel. MM NichtWGebäude'!$R8+(1000*'Schadensrel. MM NichtWGebäude'!$S8*SQRT(CG8)),\n  IF(CF8=0,\n   0,\n   IF('Schadensrel. MM NichtWGebäude'!$O8=Berechnungsgrundlagen!$D$18,\n    'Schadensrel. MM NichtWGebäude'!$R8+(1000*'Schadensrel. MM NichtWGebäude'!$S8*SQRT(CF8)),\n     IF(CE8<='Schadensrel. MM NichtWGebäude'!$N8,\n      0,\n      'Schadensrel. MM NichtWGebäude'!$R8+(1000*'Schadensrel. MM NichtWGebäude'!$S8*SQRT(CF8)))))),0)","v":0},{"$f":"IF(CE8=0,0,\nIF((CE8-'Schadensrel. MM NichtWGebäude'!$N8)<=0,\n 0,\n IF(((CE8-'Schadensrel. MM NichtWGebäude'!$N8))>(IF(\n    ('Schadensrel. MM NichtWGebäude'!$J8+'Schadensrel. MM NichtWGebäude'!$K8)=0,\n     (Berechnungsgrundlagen!$I$20+Berechnungsgrundlagen!$I$21),\n     ('Schadensrel. MM NichtWGebäude'!$J8+'Schadensrel. MM NichtWGebäude'!$K8))),\n  IF(('Schadensrel. MM NichtWGebäude'!$J8+'Schadensrel. MM NichtWGebäude'!$K8)=0,\n   (Berechnungsgrundlagen!$I$20+Berechnungsgrundlagen!$I$21),\n   ('Schadensrel. MM NichtWGebäude'!$J8+'Schadensrel. MM NichtWGebäude'!$K8)),\n  ((CE8-'Schadensrel. MM NichtWGebäude'!$N8)))))","v":0},null,{"$f":"IF(CJ8>0,'Schadensrel. MM NichtWGebäude'!$T8+(1000*'Schadensrel. MM NichtWGebäude'!$U8*SQRT(CJ8)),IF(CI8=0,0,IF(CE8<='Schadensrel. MM NichtWGebäude'!$N8,0, 'Schadensrel. MM NichtWGebäude'!$T8+(1000*'Schadensrel. MM NichtWGebäude'!$U8*SQRT(CI8)))))","v":0},{"$f":"IF(CE8=0,\n 0,\n CE8-('Schadensrel. MM NichtWGebäude'!$N8+\n   IF(('Schadensrel. MM NichtWGebäude'!$J8+'Schadensrel. Merkmale WGebäude'!$K21)=0,\n    Berechnungsgrundlagen!$I$20+Berechnungsgrundlagen!$I$21,\n    'Schadensrel. MM NichtWGebäude'!$J8+'Schadensrel. MM NichtWGebäude'!$K8)))","v":0},null,{"$f":"IF(CM8>0,\n 'Schadensrel. MM NichtWGebäude'!$V8+(1000*'Schadensrel. MM NichtWGebäude'!$X8*SQRT(CM8)),\n IF(CE8<=('Schadensrel. MM NichtWGebäude'!N8+IF(\n    ('Schadensrel. MM NichtWGebäude'!$J8+'Schadensrel. MM NichtWGebäude'!$K8)=0,\n     Berechnungsgrundlagen!$I$20+Berechnungsgrundlagen!$I$21,\n     'Schadensrel. MM NichtWGebäude'!$J8+'Schadensrel. MM NichtWGebäude'!$K8)),\n  0,\n  ('Schadensrel. MM NichtWGebäude'!$V8+(1000*'Schadensrel. MM NichtWGebäude'!$X8*SQRT(CL8)))))","v":0},{"$f":"IF(CE8=0,0,'Schadensrel. MM NichtWGebäude'!$Y8)","v":0},null,{"$f":"SUM(CH8+CK8+CN8+CO8)*(IF($CE$5>50,1,IF(CP8=0,1,1-CP8)))","v":0},null,null,null,null,{"$f":"IF(CU8=0,\n 0,\n IF(('Schadensrel. MM NichtWGebäude'!H8+'Schadensrel. MM NichtWGebäude'!I8)=0,\n  (IF((Berechnungsgrundlagen!$I$18+Berechnungsgrundlagen!$I$19-'Schadensrel. MM NichtWGebäude'!$N8+$CU8)>(Berechnungsgrundlagen!$I$18+Berechnungsgrundlagen!$I$19),\n   (Berechnungsgrundlagen!$I$18+Berechnungsgrundlagen!$I$19),\n   (Berechnungsgrundlagen!$I$18+Berechnungsgrundlagen!$I$19-'Schadensrel. MM NichtWGebäude'!$N8+$CU8))),\n (IF(('Schadensrel. MM NichtWGebäude'!$H8+'Schadensrel. MM NichtWGebäude'!$I8-'Schadensrel. MM NichtWGebäude'!$N8+$CU8)>('Schadensrel. MM NichtWGebäude'!$H8+'Schadensrel. MM NichtWGebäude'!$I8),\n  ('Schadensrel. MM NichtWGebäude'!$H8+'Schadensrel. MM NichtWGebäude'!$I8),\n  ('Schadensrel. MM NichtWGebäude'!$H8+'Schadensrel. MM NichtWGebäude'!$I8-'Schadensrel. MM NichtWGebäude'!$N8+$CU8)))))","v":0},null,{"$f":"IF('Schadensrel. MM NichtWGebäude'!$F8=Berechnungsgrundlagen!$D$17,\n IF(CW8>0,\n  'Schadensrel. MM NichtWGebäude'!$R8+(1000*'Schadensrel. MM NichtWGebäude'!$S8*SQRT(CW8)),\n  IF(CV8=0,\n   0,\n   IF('Schadensrel. MM NichtWGebäude'!$O8=Berechnungsgrundlagen!$D$18,\n    'Schadensrel. MM NichtWGebäude'!$R8+(1000*'Schadensrel. MM NichtWGebäude'!$S8*SQRT(CV8)),\n     IF(CU8<='Schadensrel. MM NichtWGebäude'!$N8,\n      0,\n      'Schadensrel. MM NichtWGebäude'!$R8+(1000*'Schadensrel. MM NichtWGebäude'!$S8*SQRT(CV8)))))),0)","v":0},{"$f":"IF(CU8=0,0,\nIF((CU8-'Schadensrel. MM NichtWGebäude'!$N8)<=0,\n 0,\n IF(((CU8-'Schadensrel. MM NichtWGebäude'!$N8))>(IF(\n    ('Schadensrel. MM NichtWGebäude'!$J8+'Schadensrel. MM NichtWGebäude'!$K8)=0,\n     (Berechnungsgrundlagen!$I$20+Berechnungsgrundlagen!$I$21),\n     ('Schadensrel. MM NichtWGebäude'!$J8+'Schadensrel. MM NichtWGebäude'!$K8))),\n  IF(('Schadensrel. MM NichtWGebäude'!$J8+'Schadensrel. MM NichtWGebäude'!$K8)=0,\n   (Berechnungsgrundlagen!$I$20+Berechnungsgrundlagen!$I$21),\n   ('Schadensrel. MM NichtWGebäude'!$J8+'Schadensrel. MM NichtWGebäude'!$K8)),\n  ((CU8-'Schadensrel. MM NichtWGebäude'!$N8)))))","v":0},null,{"$f":"IF(CZ8>0,'Schadensrel. MM NichtWGebäude'!$T8+(1000*'Schadensrel. MM NichtWGebäude'!$U8*SQRT(CZ8)),IF(CY8=0,0,IF(CU8<='Schadensrel. MM NichtWGebäude'!$N8,0, 'Schadensrel. MM NichtWGebäude'!$T8+(1000*'Schadensrel. MM NichtWGebäude'!$U8*SQRT(CY8)))))","v":0},{"$f":"IF(CU8=0,\n 0,\n CU8-('Schadensrel. MM NichtWGebäude'!$N8+\n   IF(('Schadensrel. MM NichtWGebäude'!$J8+'Schadensrel. Merkmale WGebäude'!$K21)=0,\n    Berechnungsgrundlagen!$I$20+Berechnungsgrundlagen!$I$21,\n    'Schadensrel. MM NichtWGebäude'!$J8+'Schadensrel. MM NichtWGebäude'!$K8)))","v":0},null,{"$f":"IF(DC8>0,\n 'Schadensrel. MM NichtWGebäude'!$V8+(1000*'Schadensrel. MM NichtWGebäude'!$X8*SQRT(DC8)),\n IF(CU8<=('Schadensrel. MM NichtWGebäude'!N8+IF(\n    ('Schadensrel. MM NichtWGebäude'!$J8+'Schadensrel. MM NichtWGebäude'!$K8)=0,\n     Berechnungsgrundlagen!$I$20+Berechnungsgrundlagen!$I$21,\n     'Schadensrel. MM NichtWGebäude'!$J8+'Schadensrel. MM NichtWGebäude'!$K8)),\n  0,\n  ('Schadensrel. MM NichtWGebäude'!$V8+(1000*'Schadensrel. MM NichtWGebäude'!$X8*SQRT(DB8)))))","v":0},{"$f":"IF(CU8=0,0,'Schadensrel. MM NichtWGebäude'!$Y8)","v":0},null,{"$f":"SUM(CX8+DA8+DD8+DE8)*(IF($CU$5>50,1,IF(DF8=0,1,1-DF8)))","v":0}]
[]
[null,null,null,null,null,null,null,null,null,null,null,null,null,null,null,null,{"$f":"SUM(Q7:Q8)","v":0},null,null,null,null,null,null,null,null,null,null,null,null,null,null,null,{"$f":"SUM(AG7:AG8)","v":0},null,null,null,null,null,null,null,null,null,null,null,null,null,null,null,{"$f":"SUM(AW7:AW8)","v":0},null,null,null,null,null,null,null,null,null,null,null,null,null,null,null,{"$f":"SUM(BM7:BM8)","v":0},null,null,null,null,null,null,null,null,null,null,null,null,null,null,null,{"$f":"SUM(CC7:CC8)","v":0},null,null,null,null,null,null,null,null,null,null,null,null,null,null,null,{"$f":"SUM(CS7:CS8)","v":0},null,null,null,null,null,null,null,null,null,null,null,null,null,null,null,{"$f":"SUM(DI7:DI8)","v":0}]
["Nicht - Wohngebäude sowie Gewerbe und Industrie bei HQx",null,{"$f":"C5","v":0},null,null,null,null,null,null,null,null,null,null,null,null,null,null,null,{"$f":"S5","v":0},null,null,null,null,null,null,null,null,null,null,null,null,null,null,null,{"$f":"AI5","v":0},null,null,null,null,null,null,null,null,null,null,null,null,null,null,null,{"$f":"AY5","v":0},null,null,null,null,null,null,null,null,null,null,null,null,null,null,null,{"$f":"BO5","v":0},null,null,null,null,null,null,null,null,null,null,null,null,null,null,null,{"$f":"CE5","v":100},null,null,null,null,null,null,null,null,null,null,null,null,null,null,null,{"$f":"CU5","v":0}]
[null,null,{"$f":"SUM(O7:P8)","v":0},null,null,null,null,null,null,null,null,null,null,null,null,null,null,null,{"$f":"SUM(AE7:AF8)","v":0},null,null,null,null,null,null,null,null,null,null,null,null,null,null,null,{"$f":"SUM(AU7:AV8)","v":0},null,null,null,null,null,null,null,null,null,null,null,null,null,null,null,{"$f":"SUM(BK7:BL8)","v":0},null,null,null,null,null,null,null,null,null,null,null,null,null,null,null,{"$f":"SUM(CA7:CB8)","v":0},null,null,null,null,null,null,null,null,null,null,null,null,null,null,null,{"$f":"SUM(CQ7:CR8)","v":0},null,null,null,null,null,null,null,null,null,null,null,null,null,null,null,{"$f":"SUM(DG7:DH8)","v":0}]

{"sheet":"Schadenseingabe Öffentl. Geb.","index":9,"n_rows":13,"n_cols":17,"rows_kept":13,"cut":false,"hidden":false,"merged":[[12,13,12,14],[12,15,12,16],[12,0,12,2],[12,3,12,4],[12,5,12,6],[12,7,12,8],[12,9,12,10],[12,11,12,12],[10,3,10,16],[11,3,11,4],[11,5,11,6],[11,7,11,8],[11,9,11,10],[11,11,11,12],[11,13,11,14],[11,15,11,16],[0,0,0,16],[2,3,2,16],[3,3,3,16],[4,3,4,4],[4,5,4,6],[4,7,4,8],[4,9,4,10],[4,11,4,12],[4,13,4,14],[4,15,4,16]]}
["Schadenseingabe Öffentliche Gebäude "]
["Öffentliche Gebäude soweit nicht unter Nicht - Wohngebäude erfasst"]
[]
[]
[null,null,"bei HQ",{"$f":"Projektgrunddaten!$C$24","v":0},null,{"$f":"Projektgrunddaten!$C$25","v":0},null,{"$f":"Projektgrunddaten!$C$26","v":0},null,{"$f":"Projektgrunddaten!$C$27","v":0},null,{"$f":"Projektgrunddaten!$C$28","v":0},null,{"$f":"Projektgrunddaten!$C$29","v":100},null,{"$f":"Projektgrunddaten!$C$30","v":0}]
["Adresse\n(Gemeinde, Straße, Nummer)","Bezeichnung bzw. Nutzung des Gebäudes\n (z.B. Pfarrhof, Trafostation, Schule, Museum, ect.)","Erhaltungszustand des Gebäudes","Wassertiefe über GOK [m]","Vermögensschaden (€)","Wassertiefe über GOK [m]","Vermögensschaden (€)","Wassertiefe über GOK [m]","Vermögensschaden (€)","Wassertiefe über GOK [m]","Vermögensschaden (€)","Wassertiefe über GOK [m]","Vermögensschaden (€)","Wassertiefe über GOK [m]","Vermögensschaden (€)","Wassertiefe über GOK [m]","Vermögensschaden (€)"]
[]
[]
[]
[]
[]
[null,null,"bei HQ",{"$f":"Projektgrunddaten!$C$24","v":0},null,{"$f":"Projektgrunddaten!$C$25","v":0},null,{"$f":"Projektgrunddaten!$C$26","v":0},null,{"$f":"Projektgrunddaten!$C$27","v":0},null,{"$f":"Projektgrunddaten!$C$28","v":0},null,{"$f":"Projektgrunddaten!$C$29","v":100},null,{"$f":"Projektgrunddaten!$C$30","v":0}]
["SUMME Vermögensschäden Öffentliche Gebäude\nsoweit nicht unter Nicht - Wohngebäude erfasst",null,null,{"$f":"SUM(E7:E8)","v":0},null,{"$f":"SUM(G7:G8)","v":0},null,{"$f":"SUM(I7:I8)","v":0},null,{"$f":"SUM(K7:K8)","v":0},null,{"$f":"SUM(M7:M8)","v":0},null,{"$f":"SUM(O7:O8)","v":0},null,{"$f":"SUM(Q7:Q8)","v":0}]

{"sheet":"Wertschöpfungsverluste","index":10,"n_rows":23,"n_cols":18,"rows_kept":23,"cut":false,"hidden":false,"merged":[[22,13,22,14],[22,15,22,16],[22,3,22,4],[22,5,22,6],[22,7,22,8],[22,9,22,10],[22,11,22,12],[20,3,20,16],[21,3,21,4],[21,5,21,6],[21,7,21,8],[21,9,21,10],[21,11,21,12],[21,13,21,14],[21,15,21,16],[0,0,0,17],[2,3,2,16],[3,0,4,0],[3,1,4,1],[3,2,4,2],[3,4,4,4],[3,6,4,6],[3,8,4,8],[3,10,4,10],[3,12,4,12],[3,14,4,14],[3,16,4,16],[3,17,4,17]]}
["WERTSCHÖPFUNGSVERLUSTE"]
[]
[null,null,null,"Anzahl betroffene Beschäftigte / Ausfalltage bei HQx"]
["Wirtschaftssektor\nGewerbe/Industrie","Bundesland","Anzahl Betriebe","Betroffene Beschäftigte mal Anzahl der Ausfalltage; Summe aller Betriebe des betrachteten Wirtschaftssektors","Summe der Ausfalltage im betrachteten Wirtschaftssektor\n(Arbeitstage)","Betroffene Beschäftigte mal Anzahl der Ausfalltage; Summe aller Betriebe des betrachteten Wirtschaftssektors","Summe der Ausfalltage im betrachteten Wirtschaftssektor\n(Arbeitstage)","Betroffene Beschäftigte mal Anzahl der Ausfalltage; Summe aller Betriebe des betrachteten Wirtschaftssektors","Summe der Ausfalltage im betrachteten Wirtschaftssektor\n(Arbeitstage)","Betroffene Beschäftigte mal Anzahl der Ausfalltage; Summe aller Betriebe des betrachteten Wirtschaftssektors","Summe der Ausfalltage im betrachteten Wirtschaftssektor\n(Arbeitstage)","Betroffene Beschäftigte mal Anzahl der Ausfalltage; Summe aller Betriebe des betrachteten Wirtschaftssektors","Summe der Ausfalltage im betrachteten Wirtschaftssektor\n(Arbeitstage)","Betroffene Beschäftigte mal Anzahl der Ausfalltage; Summe aller Betriebe des betrachteten Wirtschaftssektors","Summe der Ausfalltage im betrachteten Wirtschaftssektor\n(Arbeitstage)","Betroffene Beschäftigte mal Anzahl der Ausfalltage; Summe aller Betriebe des betrachteten Wirtschaftssektors","Summe der Ausfalltage im betrachteten Wirtschaftssektor\n(Arbeitstage)","Wertschöpfungs-verlust in € pro Tag und Person"]
[null,null,null,{"$f":"Projektgrunddaten!$C$24","v":0},null,{"$f":"Projektgrunddaten!$C$25","v":0},null,{"$f":"Projektgrunddaten!$C$26","v":0},null,{"$f":"Projektgrunddaten!$C$27","v":0},null,{"$f":"Projektgrunddaten!$C$28","v":0},null,{"$f":"Projektgrunddaten!$C$29","v":100},null,{"$f":"Projektgrunddaten!$C$30","v":0}]
[{"$f":"'Daten für Bruttowertschöpfung'!B2","v":"Bergbau und Gewinnung von Steinen u. Erden (B)"},{"$f":"Projektgrunddaten!$C$7","v":"Österreich"},{"$f":"COUNTIF('Schadensermittl.  NichtWGebäude'!$B$7:$B$8,$A6)","v":0},{"$f":"SUMPRODUCT(('Schadensermittl.  NichtWGebäude'!$B$7:$B$8=$A6 )*('Schadensermittl.  NichtWGebäude'!Q$7:Q$8)*('Schadensermittl.  NichtWGebäude'!R$7:R$8))","v":0},{"$f":"SUMIF('Schadensermittl.  NichtWGebäude'!$B$7:$B$8,$A6,'Schadensermittl.  NichtWGebäude'!$R$7:$R$8)","v":0},{"$f":"SUMPRODUCT(('Schadensermittl.  NichtWGebäude'!$B$7:$B$8=$A6 )*('Schadensermittl.  NichtWGebäude'!AG$7:AG$8)*('Schadensermittl.  NichtWGebäude'!AH$7:AH$8))","v":0},{"$f":"SUMIF('Schadensermittl.  NichtWGebäude'!$B$7:$B$8,$A6,'Schadensermittl.  NichtWGebäude'!$AH$7:$AH$8)","v":0},{"$f":"SUMPRODUCT(('Schadensermittl.  NichtWGebäude'!$B$7:$B$8=$A6 )*('Schadensermittl.  NichtWGebäude'!AW$7:AW$8)*('Schadensermittl.  NichtWGebäude'!AX$7:AX$8))","v":0},{"$f":"SUMIF('Schadensermittl.  NichtWGebäude'!$B$7:$B$8,$A6,'Schadensermittl.  NichtWGebäude'!$AX$7:$AX$8)","v":0},{"$f":"SUMPRODUCT(('Schadensermittl.  NichtWGebäude'!$B$7:$B$8=$A6 )*('Schadensermittl.  NichtWGebäude'!BM$7:BM$8)*('Schadensermittl.  NichtWGebäude'!BN$7:BN$8))","v":0},{"$f":"SUMIF('Schadensermittl.  NichtWGebäude'!$B$7:$B$8,$A6,'Schadensermittl.  NichtWGebäude'!$BN$7:$BN$8)","v":0},{"$f":"SUMPRODUCT(('Schadensermittl.  NichtWGebäude'!$B$7:$B$8=$A6 )*('Schadensermittl.  NichtWGebäude'!CC$7:CC$8)*('Schadensermittl.  NichtWGebäude'!CD$7:CD$8))","v":0},{"$f":"SUMIF('Schadensermittl.  NichtWGebäude'!$B$7:$B$8,$A6,'Schadensermittl.  NichtWGebäude'!$CD$7:$CD$8)","v":0},{"$f":"SUMPRODUCT(('Schadensermittl.  NichtWGebäude'!$B$7:$B$8=$A6 )*('Schadensermittl.  NichtWGebäude'!CS$7:CS$8)*('Schadensermittl.  NichtWGebäude'!CT$7:CT$8))","v":0},{"$f":"SUMIF('Schadensermittl.  NichtWGebäude'!$B$7:$B$8,$A6,'Schadensermittl.  NichtWGebäude'!$CT$7:$CT$8)","v":0},{"$f":"SUMPRODUCT(('Schadensermittl.  NichtWGebäude'!$B$7:$B$8=$A6 )*('Schadensermittl.  NichtWGebäude'!DI$7:DI$8)*('Schadensermittl.  NichtWGebäude'!DJ$7:DJ$8))","v":0},{"$f":"SUMIF('Schadensermittl.  NichtWGebäude'!$B$7:$B$8,$A6,'Schadensermittl.  NichtWGebäude'!$DJ$7:$DJ$8)","v":0},{"$f":"IF(OR($A6=0,$B6=0),0,INDEX('Daten für Bruttowertschöpfung'!$C$2:$L$15,MATCH(Wertschöpfungsverluste!$A6,'Daten für Bruttowertschöpfung'!$B$2:$B$15,0),MATCH(Wertschöpfungsverluste!$B6,'Daten für Bruttowertschöpfung'!$C$1:$L$1,0)))","v":969.17194685360778}]
[{"$f":"'Daten für Bruttowertschöpfung'!B3","v":"Herstellung von Waren  (C)"},{"$f":"Projektgrunddaten!$C$7","v":"Österreich"},{"$f":"COUNTIF('Schadensermittl.  NichtWGebäude'!$B$7:$B$8,$A7)","v":0},{"$f":"SUMPRODUCT(('Schadensermittl.  NichtWGebäude'!$B$7:$B$8=$A7 )*('Schadensermittl.  NichtWGebäude'!Q$7:Q$8)*('Schadensermittl.  NichtWGebäude'!R$7:R$8))","v":0},{"$f":"SUMIF('Schadensermittl.  NichtWGebäude'!$B$7:$B$8,$A7,'Schadensermittl.  NichtWGebäude'!$R$7:$R$8)","v":0},{"$f":"SUMPRODUCT(('Schadensermittl.  NichtWGebäude'!$B$7:$B$8=$A7 )*('Schadensermittl.  NichtWGebäude'!AG$7:AG$8)*('Schadensermittl.  NichtWGebäude'!AH$7:AH$8))","v":0},{"$f":"SUMIF('Schadensermittl.  NichtWGebäude'!$B$7:$B$8,$A7,'Schadensermittl.  NichtWGebäude'!$AH$7:$AH$8)","v":0},{"$f":"SUMPRODUCT(('Schadensermittl.  NichtWGebäude'!$B$7:$B$8=$A7 )*('Schadensermittl.  NichtWGebäude'!AW$7:AW$8)*('Schadensermittl.  NichtWGebäude'!AX$7:AX$8))","v":0},{"$f":"SUMIF('Schadensermittl.  NichtWGebäude'!$B$7:$B$8,$A7,'Schadensermittl.  NichtWGebäude'!$AX$7:$AX$8)","v":0},{"$f":"SUMPRODUCT(('Schadensermittl.  NichtWGebäude'!$B$7:$B$8=$A7 )*('Schadensermittl.  NichtWGebäude'!BM$7:BM$8)*('Schadensermittl.  NichtWGebäude'!BN$7:BN$8))","v":0},{"$f":"SUMIF('Schadensermittl.  NichtWGebäude'!$B$7:$B$8,$A7,'Schadensermittl.  NichtWGebäude'!$BN$7:$BN$8)","v":0},{"$f":"SUMPRODUCT(('Schadensermittl.  NichtWGebäude'!$B$7:$B$8=$A7 )*('Schadensermittl.  NichtWGebäude'!CC$7:CC$8)*('Schadensermittl.  NichtWGebäude'!CD$7:CD$8))","v":0},{"$f":"SUMIF('Schadensermittl.  NichtWGebäude'!$B$7:$B$8,$A7,'Schadensermittl.  NichtWGebäude'!$CD$7:$CD$8)","v":0},{"$f":"SUMPRODUCT(('Schadensermittl.  NichtWGebäude'!$B$7:$B$8=$A7 )*('Schadensermittl.  NichtWGebäude'!CS$7:CS$8)*('Schadensermittl.  NichtWGebäude'!CT$7:CT$8))","v":0},{"$f":"SUMIF('Schadensermittl.  NichtWGebäude'!$B$7:$B$8,$A7,'Schadensermittl.  NichtWGebäude'!$CT$7:$CT$8)","v":0},{"$f":"SUMPRODUCT(('Schadensermittl.  NichtWGebäude'!$B$7:$B$8=$A7 )*('Schadensermittl.  NichtWGebäude'!DI$7:DI$8)*('Schadensermittl.  NichtWGebäude'!DJ$7:DJ$8))","v":0},{"$f":"SUMIF('Schadensermittl.  NichtWGebäude'!$B$7:$B$8,$A7,'Schadensermittl.  NichtWGebäude'!$DJ$7:$DJ$8)","v":0},{"$f":"IF(OR($A7=0,$B7=0),0,INDEX('Daten für Bruttowertschöpfung'!$C$2:$L$15,MATCH(Wertschöpfungsverluste!$A7,'Daten für Bruttowertschöpfung'!$B$2:$B$15,0),MATCH(Wertschöpfungsverluste!$B7,'Daten für Bruttowertschöpfung'!$C$1:$L$1,0)))","v":356.46756353921086}]
[{"$f":"'Daten für Bruttowertschöpfung'!B4","v":"Energieversorgung (D)"},{"$f":"Projektgrunddaten!$C$7","v":"Österreich"},{"$f":"COUNTIF('Schadensermittl.  NichtWGebäude'!$B$7:$B$8,$A8)","v":0},{"$f":"SUMPRODUCT(('Schadensermittl.  NichtWGebäude'!$B$7:$B$8=$A8 )*('Schadensermittl.  NichtWGebäude'!Q$7:Q$8)*('Schadensermittl.  NichtWGebäude'!R$7:R$8))","v":0},{"$f":"SUMIF('Schadensermittl.  NichtWGebäude'!$B$7:$B$8,$A8,'Schadensermittl.  NichtWGebäude'!$R$7:$R$8)","v":0},{"$f":"SUMPRODUCT(('Schadensermittl.  NichtWGebäude'!$B$7:$B$8=$A8 )*('Schadensermittl.  NichtWGebäude'!AG$7:AG$8)*('Schadensermittl.  NichtWGebäude'!AH$7:AH$8))","v":0},{"$f":"SUMIF('Schadensermittl.  NichtWGebäude'!$B$7:$B$8,$A8,'Schadensermittl.  NichtWGebäude'!$AH$7:$AH$8)","v":0},{"$f":"SUMPRODUCT(('Schadensermittl.  NichtWGebäude'!$B$7:$B$8=$A8 )*('Schadensermittl.  NichtWGebäude'!AW$7:AW$8)*('Schadensermittl.  NichtWGebäude'!AX$7:AX$8))","v":0},{"$f":"SUMIF('Schadensermittl.  NichtWGebäude'!$B$7:$B$8,$A8,'Schadensermittl.  NichtWGebäude'!$AX$7:$AX$8)","v":0},{"$f":"SUMPRODUCT(('Schadensermittl.  NichtWGebäude'!$B$7:$B$8=$A8 )*('Schadensermittl.  NichtWGebäude'!BM$7:BM$8)*('Schadensermittl.  NichtWGebäude'!BN$7:BN$8))","v":0},{"$f":"SUMIF('Schadensermittl.  NichtWGebäude'!$B$7:$B$8,$A8,'Schadensermittl.  NichtWGebäude'!$BN$7:$BN$8)","v":0},{"$f":"SUMPRODUCT(('Schadensermittl.  NichtWGebäude'!$B$7:$B$8=$A8 )*('Schadensermittl.  NichtWGebäude'!CC$7:CC$8)*('Schadensermittl.  NichtWGebäude'!CD$7:CD$8))","v":0},{"$f":"SUMIF('Schadensermittl.  NichtWGebäude'!$B$7:$B$8,$A8,'Schadensermittl.  NichtWGebäude'!$CD$7:$CD$8)","v":0},{"$f":"SUMPRODUCT(('Schadensermittl.  NichtWGebäude'!$B$7:$B$8=$A8 )*('Schadensermittl.  NichtWGebäude'!CS$7:CS$8)*('Schadensermittl.  NichtWGebäude'!CT$7:CT$8))","v":0},{"$f":"SUMIF('Schadensermittl.  NichtWGebäude'!$B$7:$B$8,$A8,'Schadensermittl.  NichtWGebäude'!$CT$7:$CT$8)","v":0},{"$f":"SUMPRODUCT(('Schadensermittl.  NichtWGebäude'!$B$7:$B$8=$A8 )*('Schadensermittl.  NichtWGebäude'!DI$7:DI$8)*('Schadensermittl.  NichtWGebäude'!DJ$7:DJ$8))","v":0},{"$f":"SUMIF('Schadensermittl.  NichtWGebäude'!$B$7:$B$8,$A8,'Schadensermittl.  NichtWGebäude'!$DJ$7:$DJ$8)","v":0},{"$f":"IF(OR($A8=0,$B8=0),0,INDEX('Daten für Bruttowertschöpfung'!$C$2:$L$15,MATCH(Wertschöpfungsverluste!$A8,'Daten für Bruttowertschöpfung'!$B$2:$B$15,0),MATCH(Wertschöpfungsverluste!$B8,'Daten für Bruttowertschöpfung'!$C$1:$L$1,0)))","v":853.90020566820317}]
[{"$f":"'Daten für Bruttowertschöpfung'!B5","v":"Wasserversorgung; Abwasser- u. Abfallentsorgung u. Beseitigung v. Umweltverschmutzungen (E)"},{"$f":"Projektgrunddaten!$C$7","v":"Österreich"},{"$f":"COUNTIF('Schadensermittl.  NichtWGebäude'!$B$7:$B$8,$A9)","v":0},{"$f":"SUMPRODUCT(('Schadensermittl.  NichtWGebäude'!$B$7:$B$8=$A9 )*('Schadensermittl.  NichtWGebäude'!Q$7:Q$8)*('Schadensermittl.  NichtWGebäude'!R$7:R$8))","v":0},{"$f":"SUMIF('Schadensermittl.  NichtWGebäude'!$B$7:$B$8,$A9,'Schadensermittl.  NichtWGebäude'!$R$7:$R$8)","v":0},{"$f":"SUMPRODUCT(('Schadensermittl.  NichtWGebäude'!$B$7:$B$8=$A9 )*('Schadensermittl.  NichtWGebäude'!AG$7:AG$8)*('Schadensermittl.  NichtWGebäude'!AH$7:AH$8))","v":0},{"$f":"SUMIF('Schadensermittl.  NichtWGebäude'!$B$7:$B$8,$A9,'Schadensermittl.  NichtWGebäude'!$AH$7:$AH$8)","v":0},{"$f":"SUMPRODUCT(('Schadensermittl.  NichtWGebäude'!$B$7:$B$8=$A9 )*('Schadensermittl.  NichtWGebäude'!AW$7:AW$8)*('Schadensermittl.  NichtWGebäude'!AX$7:AX$8))","v":0},{"$f":"SUMIF('Schadensermittl.  NichtWGebäude'!$B$7:$B$8,$A9,'Schadensermittl.  NichtWGebäude'!$AX$7:$AX$8)","v":0},{"$f":"SUMPRODUCT(('Schadensermittl.  NichtWGebäude'!$B$7:$B$8=$A9 )*('Schadensermittl.  NichtWGebäude'!BM$7:BM$8)*('Schadensermittl.  NichtWGebäude'!BN$7:BN$8))","v":0},{"$f":"SUMIF('Schadensermittl.  NichtWGebäude'!$B$7:$B$8,$A9,'Schadensermittl.  NichtWGebäude'!$BN$7:$BN$8)","v":0},{"$f":"SUMPRODUCT(('Schadensermittl.  NichtWGebäude'!$B$7:$B$8=$A9 )*('Schadensermittl.  NichtWGebäude'!CC$7:CC$8)*('Schadensermittl.  NichtWGebäude'!CD$7:CD$8))","v":0},{"$f":"SUMIF('Schadensermittl.  NichtWGebäude'!$B$7:$B$8,$A9,'Schadensermittl.  NichtWGebäude'!$CD$7:$CD$8)","v":0},{"$f":"SUMPRODUCT(('Schadensermittl.  NichtWGebäude'!$B$7:$B$8=$A9 )*('Schadensermittl.  NichtWGebäude'!CS$7:CS$8)*('Schadensermittl.  NichtWGebäude'!CT$7:CT$8))","v":0},{"$f":"SUMIF('Schadensermittl.  NichtWGebäude'!$B$7:$B$8,$A9,'Schadensermittl.  NichtWGebäude'!$CT$7:$CT$8)","v":0},{"$f":"SUMPRODUCT(('Schadensermittl.  NichtWGebäude'!$B$7:$B$8=$A9 )*('Schadensermittl.  NichtWGebäude'!DI$7:DI$8)*('Schadensermittl.  NichtWGebäude'!DJ$7:DJ$8))","v":0},{"$f":"SUMIF('Schadensermittl.  NichtWGebäude'!$B$7:$B$8,$A9,'Schadensermittl.  NichtWGebäude'!$DJ$7:$DJ$8)","v":0},{"$f":"IF(OR($A9=0,$B9=0),0,INDEX('Daten für Bruttowertschöpfung'!$C$2:$L$15,MATCH(Wertschöpfungsverluste!$A9,'Daten für Bruttowertschöpfung'!$B$2:$B$15,0),MATCH(Wertschöpfungsverluste!$B9,'Daten für Bruttowertschöpfung'!$C$1:$L$1,0)))","v":430.46382950929808}]
[{"$f":"'Daten für Bruttowertschöpfung'!B6","v":"Bau (F)"},{"$f":"Projektgrunddaten!$C$7","v":"Österreich"},{"$f":"COUNTIF('Schadensermittl.  NichtWGebäude'!$B$7:$B$8,$A10)","v":0},{"$f":"SUMPRODUCT(('Schadensermittl.  NichtWGebäude'!$B$7:$B$8=$A10 )*('Schadensermittl.  NichtWGebäude'!Q$7:Q$8)*('Schadensermittl.  NichtWGebäude'!R$7:R$8))","v":0},{"$f":"SUMIF('Schadensermittl.  NichtWGebäude'!$B$7:$B$8,$A10,'Schadensermittl.  NichtWGebäude'!$R$7:$R$8)","v":0},{"$f":"SUMPRODUCT(('Schadensermittl.  NichtWGebäude'!$B$7:$B$8=$A10 )*('Schadensermittl.  NichtWGebäude'!AG$7:AG$8)*('Schadensermittl.  NichtWGebäude'!AH$7:AH$8))","v":0},{"$f":"SUMIF('Schadensermittl.  NichtWGebäude'!$B$7:$B$8,$A10,'Schadensermittl.  NichtWGebäude'!$AH$7:$AH$8)","v":0},{"$f":"SUMPRODUCT(('Schadensermittl.  NichtWGebäude'!$B$7:$B$8=$A10 )*('Schadensermittl.  NichtWGebäude'!AW$7:AW$8)*('Schadensermittl.  NichtWGebäude'!AX$7:AX$8))","v":0},{"$f":"SUMIF('Schadensermittl.  NichtWGebäude'!$B$7:$B$8,$A10,'Schadensermittl.  NichtWGebäude'!$AX$7:$AX$8)","v":0},{"$f":"SUMPRODUCT(('Schadensermittl.  NichtWGebäude'!$B$7:$B$8=$A10 )*('Schadensermittl.  NichtWGebäude'!BM$7:BM$8)*('Schadensermittl.  NichtWGebäude'!BN$7:BN$8))","v":0},{"$f":"SUMIF('Schadensermittl.  NichtWGebäude'!$B$7:$B$8,$A10,'Schadensermittl.  NichtWGebäude'!$BN$7:$BN$8)","v":0},{"$f":"SUMPRODUCT(('Schadensermittl.  NichtWGebäude'!$B$7:$B$8=$A10 )*('Schadensermittl.  NichtWGebäude'!CC$7:CC$8)*('Schadensermittl.  NichtWGebäude'!CD$7:CD$8))","v":0},{"$f":"SUMIF('Schadensermittl.  NichtWGebäude'!$B$7:$B$8,$A10,'Schadensermittl.  NichtWGebäude'!$CD$7:$CD$8)","v":0},{"$f":"SUMPRODUCT(('Schadensermittl.  NichtWGebäude'!$B$7:$B$8=$A10 )*('Schadensermittl.  NichtWGebäude'!CS$7:CS$8)*('Schadensermittl.  NichtWGebäude'!CT$7:CT$8))","v":0},{"$f":"SUMIF('Schadensermittl.  NichtWGebäude'!$B$7:$B$8,$A10,'Schadensermittl.  NichtWGebäude'!$CT$7:$CT$8)","v":0},{"$f":"SUMPRODUCT(('Schadensermittl.  NichtWGebäude'!$B$7:$B$8=$A10 )*('Schadensermittl.  NichtWGebäude'!DI$7:DI$8)*('Schadensermittl.  NichtWGebäude'!DJ$7:DJ$8))","v":0},{"$f":"SUMIF('Schadensermittl.  NichtWGebäude'!$B$7:$B$8,$A10,'Schadensermittl.  NichtWGebäude'!$DJ$7:$DJ$8)","v":0},{"$f":"IF(OR($A10=0,$B10=0),0,INDEX('Daten für Bruttowertschöpfung'!$C$2:$L$15,MATCH(Wertschöpfungsverluste!$A10,'Daten für Bruttowertschöpfung'!$B$2:$B$15,0),MATCH(Wertschöpfungsverluste!$B10,'Daten für Bruttowertschöpfung'!$C$1:$L$1,0)))","v":238.83427539094859}]
[{"$f":"'Daten für Bruttowertschöpfung'!B7","v":"Handel; Instandhaltung und Reparatur von KFZ (G)"},{"$f":"Projektgrunddaten!$C$7","v":"Österreich"},{"$f":"COUNTIF('Schadensermittl.  NichtWGebäude'!$B$7:$B$8,$A11)","v":0},{"$f":"SUMPRODUCT(('Schadensermittl.  NichtWGebäude'!$B$7:$B$8=$A11 )*('Schadensermittl.  NichtWGebäude'!Q$7:Q$8)*('Schadensermittl.  NichtWGebäude'!R$7:R$8))","v":0},{"$f":"SUMIF('Schadensermittl.  NichtWGebäude'!$B$7:$B$8,$A11,'Schadensermittl.  NichtWGebäude'!$R$7:$R$8)","v":0},{"$f":"SUMPRODUCT(('Schadensermittl.  NichtWGebäude'!$B$7:$B$8=$A11 )*('Schadensermittl.  NichtWGebäude'!AG$7:AG$8)*('Schadensermittl.  NichtWGebäude'!AH$7:AH$8))","v":0},{"$f":"SUMIF('Schadensermittl.  NichtWGebäude'!$B$7:$B$8,$A11,'Schadensermittl.  NichtWGebäude'!$AH$7:$AH$8)","v":0},{"$f":"SUMPRODUCT(('Schadensermittl.  NichtWGebäude'!$B$7:$B$8=$A11 )*('Schadensermittl.  NichtWGebäude'!AW$7:AW$8)*('Schadensermittl.  NichtWGebäude'!AX$7:AX$8))","v":0},{"$f":"SUMIF('Schadensermittl.  NichtWGebäude'!$B$7:$B$8,$A11,'Schadensermittl.  NichtWGebäude'!$AX$7:$AX$8)","v":0},{"$f":"SUMPRODUCT(('Schadensermittl.  NichtWGebäude'!$B$7:$B$8=$A11 )*('Schadensermittl.  NichtWGebäude'!BM$7:BM$8)*('Schadensermittl.  NichtWGebäude'!BN$7:BN$8))","v":0},{"$f":"SUMIF('Schadensermittl.  NichtWGebäude'!$B$7:$B$8,$A11,'Schadensermittl.  NichtWGebäude'!$BN$7:$BN$8)","v":0},{"$f":"SUMPRODUCT(('Schadensermittl.  NichtWGebäude'!$B$7:$B$8=$A11 )*('Schadensermittl.  NichtWGebäude'!CC$7:CC$8)*('Schadensermittl.  NichtWGebäude'!CD$7:CD$8))","v":0},{"$f":"SUMIF('Schadensermittl.  NichtWGebäude'!$B$7:$B$8,$A11,'Schadensermittl.  NichtWGebäude'!$CD$7:$CD$8)","v":0},{"$f":"SUMPRODUCT(('Schadensermittl.  NichtWGebäude'!$B$7:$B$8=$A11 )*('Schadensermittl.  NichtWGebäude'!CS$7:CS$8)*('Schadensermittl.  NichtWGebäude'!CT$7:CT$8))","v":0},{"$f":"SUMIF('Schadensermittl.  NichtWGebäude'!$B$7:$B$8,$A11,'Schadensermittl.  NichtWGebäude'!$CT$7:$CT$8)","v":0},{"$f":"SUMPRODUCT(('Schadensermittl.  NichtWGebäude'!$B$7:$B$8=$A11 )*('Schadensermittl.  NichtWGebäude'!DI$7:DI$8)*('Schadensermittl.  NichtWGebäude'!DJ$7:DJ$8))","v":0},{"$f":"SUMIF('Schadensermittl.  NichtWGebäude'!$B$7:$B$8,$A11,'Schadensermittl.  NichtWGebäude'!$DJ$7:$DJ$8)","v":0},{"$f":"IF(OR($A11=0,$B11=0),0,INDEX('Daten für Bruttowertschöpfung'!$C$2:$L$15,MATCH(Wertschöpfungsverluste!$A11,'Daten für Bruttowertschöpfung'!$B$2:$B$15,0),MATCH(Wertschöpfungsverluste!$B11,'Daten für Bruttowertschöpfung'!$C$1:$L$1,0)))","v":220.19691299490648}]
[{"$f":"'Daten für Bruttowertschöpfung'!B8","v":"Verkehr und Lagerei (H)"},{"$f":"Projektgrunddaten!$C$7","v":"Österreich"},{"$f":"COUNTIF('Schadensermittl.  NichtWGebäude'!$B$7:$B$8,$A12)","v":0},{"$f":"SUMPRODUCT(('Schadensermittl.  NichtWGebäude'!$B$7:$B$8=$A12 )*('Schadensermittl.  NichtWGebäude'!Q$7:Q$8)*('Schadensermittl.  NichtWGebäude'!R$7:R$8))","v":0},{"$f":"SUMIF('Schadensermittl.  NichtWGebäude'!$B$7:$B$8,$A12,'Schadensermittl.  NichtWGebäude'!$R$7:$R$8)","v":0},{"$f":"SUMPRODUCT(('Schadensermittl.  NichtWGebäude'!$B$7:$B$8=$A12 )*('Schadensermittl.  NichtWGebäude'!AG$7:AG$8)*('Schadensermittl.  NichtWGebäude'!AH$7:AH$8))","v":0},{"$f":"SUMIF('Schadensermittl.  NichtWGebäude'!$B$7:$B$8,$A12,'Schadensermittl.  NichtWGebäude'!$AH$7:$AH$8)","v":0},{"$f":"SUMPRODUCT(('Schadensermittl.  NichtWGebäude'!$B$7:$B$8=$A12 )*('Schadensermittl.  NichtWGebäude'!AW$7:AW$8)*('Schadensermittl.  NichtWGebäude'!AX$7:AX$8))","v":0},{"$f":"SUMIF('Schadensermittl.  NichtWGebäude'!$B$7:$B$8,$A12,'Schadensermittl.  NichtWGebäude'!$AX$7:$AX$8)","v":0},{"$f":"SUMPRODUCT(('Schadensermittl.  NichtWGebäude'!$B$7:$B$8=$A12 )*('Schadensermittl.  NichtWGebäude'!BM$7:BM$8)*('Schadensermittl.  NichtWGebäude'!BN$7:BN$8))","v":0},{"$f":"SUMIF('Schadensermittl.  NichtWGebäude'!$B$7:$B$8,$A12,'Schadensermittl.  NichtWGebäude'!$BN$7:$BN$8)","v":0},{"$f":"SUMPRODUCT(('Schadensermittl.  NichtWGebäude'!$B$7:$B$8=$A12 )*('Schadensermittl.  NichtWGebäude'!CC$7:CC$8)*('Schadensermittl.  NichtWGebäude'!CD$7:CD$8))","v":0},{"$f":"SUMIF('Schadensermittl.  NichtWGebäude'!$B$7:$B$8,$A12,'Schadensermittl.  NichtWGebäude'!$CD$7:$CD$8)","v":0},{"$f":"SUMPRODUCT(('Schadensermittl.  NichtWGebäude'!$B$7:$B$8=$A12 )*('Schadensermittl.  NichtWGebäude'!CS$7:CS$8)*('Schadensermittl.  NichtWGebäude'!CT$7:CT$8))","v":0},{"$f":"SUMIF('Schadensermittl.  NichtWGebäude'!$B$7:$B$8,$A12,'Schadensermittl.  NichtWGebäude'!$CT$7:$CT$8)","v":0},{"$f":"SUMPRODUCT(('Schadensermittl.  NichtWGebäude'!$B$7:$B$8=$A12 )*('Schadensermittl.  NichtWGebäude'!DI$7:DI$8)*('Schadensermittl.  NichtWGebäude'!DJ$7:DJ$8))","v":0},{"$f":"SUMIF('Schadensermittl.  NichtWGebäude'!$B$7:$B$8,$A12,'Schadensermittl.  NichtWGebäude'!$DJ$7:$DJ$8)","v":0},{"$f":"IF(OR($A12=0,$B12=0),0,INDEX('Daten für Bruttowertschöpfung'!$C$2:$L$15,MATCH(Wertschöpfungsverluste!$A12,'Daten für Bruttowertschöpfung'!$B$2:$B$15,0),MATCH(Wertschöpfungsverluste!$B12,'Daten für Bruttowertschöpfung'!$C$1:$L$1,0)))","v":314.00186940904985}]
[{"$f":"'Daten für Bruttowertschöpfung'!B9","v":"Beherbergung und Gastronomie (I)"},{"$f":"Projektgrunddaten!$C$7","v":"Österreich"},{"$f":"COUNTIF('Schadensermittl.  NichtWGebäude'!$B$7:$B$8,$A13)","v":2},{"$f":"SUMPRODUCT(('Schadensermittl.  NichtWGebäude'!$B$7:$B$8=$A13 )*('Schadensermittl.  NichtWGebäude'!Q$7:Q$8)*('Schadensermittl.  NichtWGebäude'!R$7:R$8))","v":0},{"$f":"SUMIF('Schadensermittl.  NichtWGebäude'!$B$7:$B$8,$A13,'Schadensermittl.  NichtWGebäude'!$R$7:$R$8)","v":0},{"$f":"SUMPRODUCT(('Schadensermittl.  NichtWGebäude'!$B$7:$B$8=$A13 )*('Schadensermittl.  NichtWGebäude'!AG$7:AG$8)*('Schadensermittl.  NichtWGebäude'!AH$7:AH$8))","v":0},{"$f":"SUMIF('Schadensermittl.  NichtWGebäude'!$B$7:$B$8,$A13,'Schadensermittl.  NichtWGebäude'!$AH$7:$AH$8)","v":0},{"$f":"SUMPRODUCT(('Schadensermittl.  NichtWGebäude'!$B$7:$B$8=$A13 )*('Schadensermittl.  NichtWGebäude'!AW$7:AW$8)*('Schadensermittl.  NichtWGebäude'!AX$7:AX$8))","v":0},{"$f":"SUMIF('Schadensermittl.  NichtWGebäude'!$B$7:$B$8,$A13,'Schadensermittl.  NichtWGebäude'!$AX$7:$AX$8)","v":0},{"$f":"SUMPRODUCT(('Schadensermittl.  NichtWGebäude'!$B$7:$B$8=$A13 )*('Schadensermittl.  NichtWGebäude'!BM$7:BM$8)*('Schadensermittl.  NichtWGebäude'!BN$7:BN$8))","v":0},{"$f":"SUMIF('Schadensermittl.  NichtWGebäude'!$B$7:$B$8,$A13,'Schadensermittl.  NichtWGebäude'!$BN$7:$BN$8)","v":0},{"$f":"SUMPRODUCT(('Schadensermittl.  NichtWGebäude'!$B$7:$B$8=$A13 )*('Schadensermittl.  NichtWGebäude'!CC$7:CC$8)*('Schadensermittl.  NichtWGebäude'!CD$7:CD$8))","v":0},{"$f":"SUMIF('Schadensermittl.  NichtWGebäude'!$B$7:$B$8,$A13,'Schadensermittl.  NichtWGebäude'!$CD$7:$CD$8)","v":0},{"$f":"SUMPRODUCT(('Schadensermittl.  NichtWGebäude'!$B$7:$B$8=$A13 )*('Schadensermittl.  NichtWGebäude'!CS$7:CS$8)*('Schadensermittl.  NichtWGebäude'!CT$7:CT$8))","v":0},{"$f":"SUMIF('Schadensermittl.  NichtWGebäude'!$B$7:$B$8,$A13,'Schadensermittl.  NichtWGebäude'!$CT$7:$CT$8)","v":0},{"$f":"SUMPRODUCT(('Schadensermittl.  NichtWGebäude'!$B$7:$B$8=$A13 )*('Schadensermittl.  NichtWGebäude'!DI$7:DI$8)*('Schadensermittl.  NichtWGebäude'!DJ$7:DJ$8))","v":0},{"$f":"SUMIF('Schadensermittl.  NichtWGebäude'!$B$7:$B$8,$A13,'Schadensermittl.  NichtWGebäude'!$DJ$7:$DJ$8)","v":0},{"$f":"IF(OR($A13=0,$B13=0),0,INDEX('Daten für Bruttowertschöpfung'!$C$2:$L$15,MATCH(Wertschöpfungsverluste!$A13,'Daten für Bruttowertschöpfung'!$B$2:$B$15,0),MATCH(Wertschöpfungsverluste!$B13,'Daten für Bruttowertschöpfung'!$C$1:$L$1,0)))","v":128.36299497159172}]
[{"$f":"'Daten für Bruttowertschöpfung'!B10","v":"Information und Kommunikation (J)"},{"$f":"Projektgrunddaten!$C$7","v":"Österreich"},{"$f":"COUNTIF('Schadensermittl.  NichtWGebäude'!$B$7:$B$8,$A14)","v":0},{"$f":"SUMPRODUCT(('Schadensermittl.  NichtWGebäude'!$B$7:$B$8=$A14 )*('Schadensermittl.  NichtWGebäude'!Q$7:Q$8)*('Schadensermittl.  NichtWGebäude'!R$7:R$8))","v":0},{"$f":"SUMIF('Schadensermittl.  NichtWGebäude'!$B$7:$B$8,$A14,'Schadensermittl.  NichtWGebäude'!$R$7:$R$8)","v":0},{"$f":"SUMPRODUCT(('Schadensermittl.  NichtWGebäude'!$B$7:$B$8=$A14 )*('Schadensermittl.  NichtWGebäude'!AG$7:AG$8)*('Schadensermittl.  NichtWGebäude'!AH$7:AH$8))","v":0},{"$f":"SUMIF('Schadensermittl.  NichtWGebäude'!$B$7:$B$8,$A14,'Schadensermittl.  NichtWGebäude'!$AH$7:$AH$8)","v":0},{"$f":"SUMPRODUCT(('Schadensermittl.  NichtWGebäude'!$B$7:$B$8=$A14 )*('Schadensermittl.  NichtWGebäude'!AW$7:AW$8)*('Schadensermittl.  NichtWGebäude'!AX$7:AX$8))","v":0},{"$f":"SUMIF('Schadensermittl.  NichtWGebäude'!$B$7:$B$8,$A14,'Schadensermittl.  NichtWGebäude'!$AX$7:$AX$8)","v":0},{"$f":"SUMPRODUCT(('Schadensermittl.  NichtWGebäude'!$B$7:$B$8=$A14 )*('Schadensermittl.  NichtWGebäude'!BM$7:BM$8)*('Schadensermittl.  NichtWGebäude'!BN$7:BN$8))","v":0},{"$f":"SUMIF('Schadensermittl.  NichtWGebäude'!$B$7:$B$8,$A14,'Schadensermittl.  NichtWGebäude'!$BN$7:$BN$8)","v":0},{"$f":"SUMPRODUCT(('Schadensermittl.  NichtWGebäude'!$B$7:$B$8=$A14 )*('Schadensermittl.  NichtWGebäude'!CC$7:CC$8)*('Schadensermittl.  NichtWGebäude'!CD$7:CD$8))","v":0},{"$f":"SUMIF('Schadensermittl.  NichtWGebäude'!$B$7:$B$8,$A14,'Schadensermittl.  NichtWGebäude'!$CD$7:$CD$8)","v":0},{"$f":"SUMPRODUCT(('Schadensermittl.  NichtWGebäude'!$B$7:$B$8=$A14 )*('Schadensermittl.  NichtWGebäude'!CS$7:CS$8)*('Schadensermittl.  NichtWGebäude'!CT$7:CT$8))","v":0},{"$f":"SUMIF('Schadensermittl.  NichtWGebäude'!$B$7:$B$8,$A14,'Schadensermittl.  NichtWGebäude'!$CT$7:$CT$8)","v":0},{"$f":"SUMPRODUCT(('Schadensermittl.  NichtWGebäude'!$B$7:$B$8=$A14 )*('Schadensermittl.  NichtWGebäude'!DI$7:DI$8)*('Schadensermittl.  NichtWGebäude'!DJ$7:DJ$8))","v":0},{"$f":"SUMIF('Schadensermittl.  NichtWGebäude'!$B$7:$B$8,$A14,'Schadensermittl.  NichtWGebäude'!$DJ$7:$DJ$8)","v":0},{"$f":"IF(OR($A14=0,$B14=0),0,INDEX('Daten für Bruttowertschöpfung'!$C$2:$L$15,MATCH(Wertschöpfungsverluste!$A14,'Daten für Bruttowertschöpfung'!$B$2:$B$15,0),MATCH(Wertschöpfungsverluste!$B14,'Daten für Bruttowertschöpfung'!$C$1:$L$1,0)))","v":368.85994013392354}]
[{"$f":"'Daten für Bruttowertschöpfung'!B11","v":"Erbringung von Finanz- und Versicherungsdienstl. (K)"},{"$f":"Projektgrunddaten!$C$7","v":"Österreich"},{"$f":"COUNTIF('Schadensermittl.  NichtWGebäude'!$B$7:$B$8,$A15)","v":0},{"$f":"SUMPRODUCT(('Schadensermittl.  NichtWGebäude'!$B$7:$B$8=$A15 )*('Schadensermittl.  NichtWGebäude'!Q$7:Q$8)*('Schadensermittl.  NichtWGebäude'!R$7:R$8))","v":0},{"$f":"SUMIF('Schadensermittl.  NichtWGebäude'!$B$7:$B$8,$A15,'Schadensermittl.  NichtWGebäude'!$R$7:$R$8)","v":0},{"$f":"SUMPRODUCT(('Schadensermittl.  NichtWGebäude'!$B$7:$B$8=$A15 )*('Schadensermittl.  NichtWGebäude'!AG$7:AG$8)*('Schadensermittl.  NichtWGebäude'!AH$7:AH$8))","v":0},{"$f":"SUMIF('Schadensermittl.  NichtWGebäude'!$B$7:$B$8,$A15,'Schadensermittl.  NichtWGebäude'!$AH$7:$AH$8)","v":0},{"$f":"SUMPRODUCT(('Schadensermittl.  NichtWGebäude'!$B$7:$B$8=$A15 )*('Schadensermittl.  NichtWGebäude'!AW$7:AW$8)*('Schadensermittl.  NichtWGebäude'!AX$7:AX$8))","v":0},{"$f":"SUMIF('Schadensermittl.  NichtWGebäude'!$B$7:$B$8,$A15,'Schadensermittl.  NichtWGebäude'!$AX$7:$AX$8)","v":0},{"$f":"SUMPRODUCT(('Schadensermittl.  NichtWGebäude'!$B$7:$B$8=$A15 )*('Schadensermittl.  NichtWGebäude'!BM$7:BM$8)*('Schadensermittl.  NichtWGebäude'!BN$7:BN$8))","v":0},{"$f":"SUMIF('Schadensermittl.  NichtWGebäude'!$B$7:$B$8,$A15,'Schadensermittl.  NichtWGebäude'!$BN$7:$BN$8)","v":0},{"$f":"SUMPRODUCT(('Schadensermittl.  NichtWGebäude'!$B$7:$B$8=$A15 )*('Schadensermittl.  NichtWGebäude'!CC$7:CC$8)*('Schadensermittl.  NichtWGebäude'!CD$7:CD$8))","v":0},{"$f":"SUMIF('Schadensermittl.  NichtWGebäude'!$B$7:$B$8,$A15,'Schadensermittl.  NichtWGebäude'!$CD$7:$CD$8)","v":0},{"$f":"SUMPRODUCT(('Schadensermittl.  NichtWGebäude'!$B$7:$B$8=$A15 )*('Schadensermittl.  NichtWGebäude'!CS$7:CS$8)*('Schadensermittl.  NichtWGebäude'!CT$7:CT$8))","v":0},{"$f":"SUMIF('Schadensermittl.  NichtWGebäude'!$B$7:$B$8,$A15,'Schadensermittl.  NichtWGebäude'!$CT$7:$CT$8)","v":0},{"$f":"SUMPRODUCT(('Schadensermittl.  NichtWGebäude'!$B$7:$B$8=$A15 )*('Schadensermittl.  NichtWGebäude'!DI$7:DI$8)*('Schadensermittl.  NichtWGebäude'!DJ$7:DJ$8))","v":0},{"$f":"SUMIF('Schadensermittl.  NichtWGebäude'!$B$7:$B$8,$A15,'Schadensermittl.  NichtWGebäude'!$DJ$7:$DJ$8)","v":0},{"$f":"IF(OR($A15=0,$B15=0),0,INDEX('Daten für Bruttowertschöpfung'!$C$2:$L$15,MATCH(Wertschöpfungsverluste!$A15,'Daten für Bruttowertschöpfung'!$B$2:$B$15,0),MATCH(Wertschöpfungsverluste!$B15,'Daten für Bruttowertschöpfung'!$C$1:$L$1,0)))","v":661.84342437594773}]
[{"$f":"'Daten für Bruttowertschöpfung'!B12","v":"Grundstücks- und Wohnungswesen (L)"},{"$f":"Projektgrunddaten!$C$7","v":"Österreich"},{"$f":"COUNTIF('Schadensermittl.  NichtWGebäude'!$B$7:$B$8,$A16)","v":0},{"$f":"SUMPRODUCT(('Schadensermittl.  NichtWGebäude'!$B$7:$B$8=$A16 )*('Schadensermittl.  NichtWGebäude'!Q$7:Q$8)*('Schadensermittl.  NichtWGebäude'!R$7:R$8))","v":0},{"$f":"SUMIF('Schadensermittl.  NichtWGebäude'!$B$7:$B$8,$A16,'Schadensermittl.  NichtWGebäude'!$R$7:$R$8)","v":0},{"$f":"SUMPRODUCT(('Schadensermittl.  NichtWGebäude'!$B$7:$B$8=$A16 )*('Schadensermittl.  NichtWGebäude'!AG$7:AG$8)*('Schadensermittl.  NichtWGebäude'!AH$7:AH$8))","v":0},{"$f":"SUMIF('Schadensermittl.  NichtWGebäude'!$B$7:$B$8,$A16,'Schadensermittl.  NichtWGebäude'!$AH$7:$AH$8)","v":0},{"$f":"SUMPRODUCT(('Schadensermittl.  NichtWGebäude'!$B$7:$B$8=$A16 )*('Schadensermittl.  NichtWGebäude'!AW$7:AW$8)*('Schadensermittl.  NichtWGebäude'!AX$7:AX$8))","v":0},{"$f":"SUMIF('Schadensermittl.  NichtWGebäude'!$B$7:$B$8,$A16,'Schadensermittl.  NichtWGebäude'!$AX$7:$AX$8)","v":0},{"$f":"SUMPRODUCT(('Schadensermittl.  NichtWGebäude'!$B$7:$B$8=$A16 )*('Schadensermittl.  NichtWGebäude'!BM$7:BM$8)*('Schadensermittl.  NichtWGebäude'!BN$7:BN$8))","v":0},{"$f":"SUMIF('Schadensermittl.  NichtWGebäude'!$B$7:$B$8,$A16,'Schadensermittl.  NichtWGebäude'!$BN$7:$BN$8)","v":0},{"$f":"SUMPRODUCT(('Schadensermittl.  NichtWGebäude'!$B$7:$B$8=$A16 )*('Schadensermittl.  NichtWGebäude'!CC$7:CC$8)*('Schadensermittl.  NichtWGebäude'!CD$7:CD$8))","v":0},{"$f":"SUMIF('Schadensermittl.  NichtWGebäude'!$B$7:$B$8,$A16,'Schadensermittl.  NichtWGebäude'!$CD$7:$CD$8)","v":0},{"$f":"SUMPRODUCT(('Schadensermittl.  NichtWGebäude'!$B$7:$B$8=$A16 )*('Schadensermittl.  NichtWGebäude'!CS$7:CS$8)*('Schadensermittl.  NichtWGebäude'!CT$7:CT$8))","v":0},{"$f":"SUMIF('Schadensermittl.  NichtWGebäude'!$B$7:$B$8,$A16,'Schadensermittl.  NichtWGebäude'!$CT$7:$CT$8)","v":0},{"$f":"SUMPRODUCT(('Schadensermittl.  NichtWGebäude'!$B$7:$B$8=$A16 )*('Schadensermittl.  NichtWGebäude'!DI$7:DI$8)*('Schadensermittl.  NichtWGebäude'!DJ$7:DJ$8))","v":0},{"$f":"SUMIF('Schadensermittl.  NichtWGebäude'!$B$7:$B$8,$A16,'Schadensermittl.  NichtWGebäude'!$DJ$7:$DJ$8)","v":0},{"$f":"IF(OR($A16=0,$B16=0),0,INDEX('Daten für Bruttowertschöpfung'!$C$2:$L$15,MATCH(Wertschöpfungsverluste!$A16,'Daten für Bruttowertschöpfung'!$B$2:$B$15,0),MATCH(Wertschöpfungsverluste!$B16,'Daten für Bruttowertschöpfung'!$C$1:$L$1,0)))","v":803.99110828599839}]
[{"$f":"'Daten für Bruttowertschöpfung'!B13","v":"Erbringung v. freiberuflichen, wissenschaftl. und techn.Dienstl. (M)"},{"$f":"Projektgrunddaten!$C$7","v":"Österreich"},{"$f":"COUNTIF('Schadensermittl.  NichtWGebäude'!$B$7:$B$8,$A17)","v":0},{"$f":"SUMPRODUCT(('Schadensermittl.  NichtWGebäude'!$B$7:$B$8=$A17 )*('Schadensermittl.  NichtWGebäude'!Q$7:Q$8)*('Schadensermittl.  NichtWGebäude'!R$7:R$8))","v":0},{"$f":"SUMIF('Schadensermittl.  NichtWGebäude'!$B$7:$B$8,$A17,'Schadensermittl.  NichtWGebäude'!$R$7:$R$8)","v":0},{"$f":"SUMPRODUCT(('Schadensermittl.  NichtWGebäude'!$B$7:$B$8=$A17 )*('Schadensermittl.  NichtWGebäude'!AG$7:AG$8)*('Schadensermittl.  NichtWGebäude'!AH$7:AH$8))","v":0},{"$f":"SUMIF('Schadensermittl.  NichtWGebäude'!$B$7:$B$8,$A17,'Schadensermittl.  NichtWGebäude'!$AH$7:$AH$8)","v":0},{"$f":"SUMPRODUCT(('Schadensermittl.  NichtWGebäude'!$B$7:$B$8=$A17 )*('Schadensermittl.  NichtWGebäude'!AW$7:AW$8)*('Schadensermittl.  NichtWGebäude'!AX$7:AX$8))","v":0},{"$f":"SUMIF('Schadensermittl.  NichtWGebäude'!$B$7:$B$8,$A17,'Schadensermittl.  NichtWGebäude'!$AX$7:$AX$8)","v":0},{"$f":"SUMPRODUCT(('Schadensermittl.  NichtWGebäude'!$B$7:$B$8=$A17 )*('Schadensermittl.  NichtWGebäude'!BM$7:BM$8)*('Schadensermittl.  NichtWGebäude'!BN$7:BN$8))","v":0},{"$f":"SUMIF('Schadensermittl.  NichtWGebäude'!$B$7:$B$8,$A17,'Schadensermittl.  NichtWGebäude'!$BN$7:$BN$8)","v":0},{"$f":"SUMPRODUCT(('Schadensermittl.  NichtWGebäude'!$B$7:$B$8=$A17 )*('Schadensermittl.  NichtWGebäude'!CC$7:CC$8)*('Schadensermittl.  NichtWGebäude'!CD$7:CD$8))","v":0},{"$f":"SUMIF('Schadensermittl.  NichtWGebäude'!$B$7:$B$8,$A17,'Schadensermittl.  NichtWGebäude'!$CD$7:$CD$8)","v":0},{"$f":"SUMPRODUCT(('Schadensermittl.  NichtWGebäude'!$B$7:$B$8=$A17 )*('Schadensermittl.  NichtWGebäude'!CS$7:CS$8)*('Schadensermittl.  NichtWGebäude'!CT$7:CT$8))","v":0},{"$f":"SUMIF('Schadensermittl.  NichtWGebäude'!$B$7:$B$8,$A17,'Schadensermittl.  NichtWGebäude'!$CT$7:$CT$8)","v":0},{"$f":"SUMPRODUCT(('Schadensermittl.  NichtWGebäude'!$B$7:$B$8=$A17 )*('Schadensermittl.  NichtWGebäude'!DI$7:DI$8)*('Schadensermittl.  NichtWGebäude'!DJ$7:DJ$8))","v":0},{"$f":"SUMIF('Schadensermittl.  NichtWGebäude'!$B$7:$B$8,$A17,'Schadensermittl.  NichtWGebäude'!$DJ$7:$DJ$8)","v":0},{"$f":"IF(OR($A17=0,$B17=0),0,INDEX('Daten für Bruttowertschöpfung'!$C$2:$L$15,MATCH(Wertschöpfungsverluste!$A17,'Daten für Bruttowertschöpfung'!$B$2:$B$15,0),MATCH(Wertschöpfungsverluste!$B17,'Daten für Bruttowertschöpfung'!$C$1:$L$1,0)))","v":260.38645491055127}]
[{"$f":"'Daten für Bruttowertschöpfung'!B14","v":"Erbringung von sonstigen wirtschaftl. Dienstleistungen (N)"},{"$f":"Projektgrunddaten!$C$7","v":"Österreich"},{"$f":"COUNTIF('Schadensermittl.  NichtWGebäude'!$B$7:$B$8,$A18)","v":0},{"$f":"SUMPRODUCT(('Schadensermittl.  NichtWGebäude'!$B$7:$B$8=$A18 )*('Schadensermittl.  NichtWGebäude'!Q$7:Q$8)*('Schadensermittl.  NichtWGebäude'!R$7:R$8))","v":0},{"$f":"SUMIF('Schadensermittl.  NichtWGebäude'!$B$7:$B$8,$A18,'Schadensermittl.  NichtWGebäude'!$R$7:$R$8)","v":0},{"$f":"SUMPRODUCT(('Schadensermittl.  NichtWGebäude'!$B$7:$B$8=$A18 )*('Schadensermittl.  NichtWGebäude'!AG$7:AG$8)*('Schadensermittl.  NichtWGebäude'!AH$7:AH$8))","v":0},{"$f":"SUMIF('Schadensermittl.  NichtWGebäude'!$B$7:$B$8,$A18,'Schadensermittl.  NichtWGebäude'!$AH$7:$AH$8)","v":0},{"$f":"SUMPRODUCT(('Schadensermittl.  NichtWGebäude'!$B$7:$B$8=$A18 )*('Schadensermittl.  NichtWGebäude'!AW$7:AW$8)*('Schadensermittl.  NichtWGebäude'!AX$7:AX$8))","v":0},{"$f":"SUMIF('Schadensermittl.  NichtWGebäude'!$B$7:$B$8,$A18,'Schadensermittl.  NichtWGebäude'!$AX$7:$AX$8)","v":0},{"$f":"SUMPRODUCT(('Schadensermittl.  NichtWGebäude'!$B$7:$B$8=$A18 )*('Schadensermittl.  NichtWGebäude'!BM$7:BM$8)*('Schadensermittl.  NichtWGebäude'!BN$7:BN$8))","v":0},{"$f":"SUMIF('Schadensermittl.  NichtWGebäude'!$B$7:$B$8,$A18,'Schadensermittl.  NichtWGebäude'!$BN$7:$BN$8)","v":0},{"$f":"SUMPRODUCT(('Schadensermittl.  NichtWGebäude'!$B$7:$B$8=$A18 )*('Schadensermittl.  NichtWGebäude'!CC$7:CC$8)*('Schadensermittl.  NichtWGebäude'!CD$7:CD$8))","v":0},{"$f":"SUMIF('Schadensermittl.  NichtWGebäude'!$B$7:$B$8,$A18,'Schadensermittl.  NichtWGebäude'!$CD$7:$CD$8)","v":0},{"$f":"SUMPRODUCT(('Schadensermittl.  NichtWGebäude'!$B$7:$B$8=$A18 )*('Schadensermittl.  NichtWGebäude'!CS$7:CS$8)*('Schadensermittl.  NichtWGebäude'!CT$7:CT$8))","v":0},{"$f":"SUMIF('Schadensermittl.  NichtWGebäude'!$B$7:$B$8,$A18,'Schadensermittl.  NichtWGebäude'!$CT$7:$CT$8)","v":0},{"$f":"SUMPRODUCT(('Schadensermittl.  NichtWGebäude'!$B$7:$B$8=$A18 )*('Schadensermittl.  NichtWGebäude'!DI$7:DI$8)*('Schadensermittl.  NichtWGebäude'!DJ$7:DJ$8))","v":0},{"$f":"SUMIF('Schadensermittl.  NichtWGebäude'!$B$7:$B$8,$A18,'Schadensermittl.  NichtWGebäude'!$DJ$7:$DJ$8)","v":0},{"$f":"IF(OR($A18=0,$B18=0),0,INDEX('Daten für Bruttowertschöpfung'!$C$2:$L$15,MATCH(Wertschöpfungsverluste!$A18,'Daten für Bruttowertschöpfung'!$B$2:$B$15,0),MATCH(Wertschöpfungsverluste!$B18,'Daten für Bruttowertschöpfung'!$C$1:$L$1,0)))","v":212.93709111595714}]
[{"$f":"'Daten für Bruttowertschöpfung'!B15","v":"Reparatur von Gebrauchsgütern (S95)"},{"$f":"Projektgrunddaten!$C$7","v":"Österreich"},{"$f":"COUNTIF('Schadensermittl.  NichtWGebäude'!$B$7:$B$8,$A19)","v":0},{"$f":"SUMPRODUCT(('Schadensermittl.  NichtWGebäude'!$B$7:$B$8=$A19 )*('Schadensermittl.  NichtWGebäude'!Q$7:Q$8)*('Schadensermittl.  NichtWGebäude'!R$7:R$8))","v":0},{"$f":"SUMIF('Schadensermittl.  NichtWGebäude'!$B$7:$B$8,$A19,'Schadensermittl.  NichtWGebäude'!$R$7:$R$8)","v":0},{"$f":"SUMPRODUCT(('Schadensermittl.  NichtWGebäude'!$B$7:$B$8=$A19 )*('Schadensermittl.  NichtWGebäude'!AG$7:AG$8)*('Schadensermittl.  NichtWGebäude'!AH$7:AH$8))","v":0},{"$f":"SUMIF('Schadensermittl.  NichtWGebäude'!$B$7:$B$8,$A19,'Schadensermittl.  NichtWGebäude'!$AH$7:$AH$8)","v":0},{"$f":"SUMPRODUCT(('Schadensermittl.  NichtWGebäude'!$B$7:$B$8=$A19 )*('Schadensermittl.  NichtWGebäude'!AW$7:AW$8)*('Schadensermittl.  NichtWGebäude'!AX$7:AX$8))","v":0},{"$f":"SUMIF('Schadensermittl.  NichtWGebäude'!$B$7:$B$8,$A19,'Schadensermittl.  NichtWGebäude'!$AX$7:$AX$8)","v":0},{"$f":"SUMPRODUCT(('Schadensermittl.  NichtWGebäude'!$B$7:$B$8=$A19 )*('Schadensermittl.  NichtWGebäude'!BM$7:BM$8)*('Schadensermittl.  NichtWGebäude'!BN$7:BN$8))","v":0},{"$f":"SUMIF('Schadensermittl.  NichtWGebäude'!$B$7:$B$8,$A19,'Schadensermittl.  NichtWGebäude'!$BN$7:$BN$8)","v":0},{"$f":"SUMPRODUCT(('Schadensermittl.  NichtWGebäude'!$B$7:$B$8=$A19 )*('Schadensermittl.  NichtWGebäude'!CC$7:CC$8)*('Schadensermittl.  NichtWGebäude'!CD$7:CD$8))","v":0},{"$f":"SUMIF('Schadensermittl.  NichtWGebäude'!$B$7:$B$8,$A19,'Schadensermittl.  NichtWGebäude'!$CD$7:$CD$8)","v":0},{"$f":"SUMPRODUCT(('Schadensermittl.  NichtWGebäude'!$B$7:$B$8=$A19 )*('Schadensermittl.  NichtWGebäude'!CS$7:CS$8)*('Schadensermittl.  NichtWGebäude'!CT$7:CT$8))","v":0},{"$f":"SUMIF('Schadensermittl.  NichtWGebäude'!$B$7:$B$8,$A19,'Schadensermittl.  NichtWGebäude'!$CT$7:$CT$8)","v":0},{"$f":"SUMPRODUCT(('Schadensermittl.  NichtWGebäude'!$B$7:$B$8=$A19 )*('Schadensermittl.  NichtWGebäude'!DI$7:DI$8)*('Schadensermittl.  NichtWGebäude'!DJ$7:DJ$8))","v":0},{"$f":"SUMIF('Schadensermittl.  NichtWGebäude'!$B$7:$B$8,$A19,'Schadensermittl.  NichtWGebäude'!$DJ$7:$DJ$8)","v":0},{"$f":"IF(OR($A19=0,$B19=0),0,INDEX('Daten für Bruttowertschöpfung'!$C$2:$L$15,MATCH(Wertschöpfungsverluste!$A19,'Daten für Bruttowertschöpfung'!$B$2:$B$15,0),MATCH(Wertschöpfungsverluste!$B19,'Daten für Bruttowertschöpfung'!$C$1:$L$1,0)))","v":139.61964780548851}]
[]
[null,null,null,"bei HQ"]
[null,null,null,{"$f":"D5","v":0},null,{"$f":"F5","v":0},null,{"$f":"H5","v":0},null,{"$f":"J5","v":0},null,{"$f":"L5","v":0},null,{"$f":"N5","v":100},null,{"$f":"P5","v":0}]
["Summen Wertschöpfungsverluste",null,null,{"$f":"SUMPRODUCT(D6:D19,$R$6:$R$19)","v":0},null,{"$f":"SUMPRODUCT(F6:F19,$R$6:$R$19)","v":0},null,{"$f":"SUMPRODUCT(H6:H19,$R$6:$R$19)","v":0},null,{"$f":"SUMPRODUCT(J6:J19,$R$6:$R$19)","v":0},null,{"$f":"SUMPRODUCT(L6:L19,$R$6:$R$19)","v":0},null,{"$f":"SUMPRODUCT(N6:N19,$R$6:$R$19)","v":0},null,{"$f":"SUMPRODUCT(P6:P19,$R$6:$R$19)","v":0}]

{"sheet":"Infrastruktur","index":11,"n_rows":183,"n_cols":17,"rows_kept":183,"cut":false,"hidden":false,"merged":[[182,15,182,16],[182,3,182,4],[182,5,182,6],[182,7,182,8],[182,9,182,10],[182,11,182,12],[182,13,182,14],[180,15,180,16],[181,3,181,4],[181,5,181,6],[181,7,181,8],[181,9,181,10],[181,11,181,12],[181,13,181,14],[181,15,181,16],[175,0,175,2],[176,0,176,2],[180,3,180,4],[180,5,180,6],[180,7,180,8],[180,9,180,10],[180,11,180,12],[180,13,180,14],[170,0,170,2],[170,3,170,4],[170,5,170,6],[170,7,170,8],[170,9,170,10],[170,11,170,12],[169,0,169,2],[169,3,169,4],[169,5,169,6],[169,7,169,8],[169,9,169,10],[169,11,169,12],[169,13,169,14],[169,15,169,16],[170,13,170,14],[170,15,170,16],[167,15,167,16],[168,0,168,2],[168,3,168,4],[168,5,168,6],[168,7,168,8],[168,9,168,10],[168,11,168,12],[168,13,168,14],[168,15,168,16],[164,0,164,2],[165,0,165,2],[167,3,167,4],[167,5,167,6],[167,7,167,8],[167,9,167,10],[161,13,161,14],[161,15,161,16],[162,0,162,2],[162,3,162,4],[162,5,162,6],[162,7,162,8],[162,9,162,10],[162,11,162,12],[162,13,162,14],[162,15,162,16],[161,0,161,2],[161,3,161,4],[161,5,161,6],[161,7,161,8],[161,9,161,10],[161,11,161,12],[167,11,167,12],[167,13,167,14],[159,13,159,14],[159,15,159,16],[160,0,160,2],[160,3,160,4],[160,5,160,6],[160,7,160,8],[160,9,160,10],[160,11,160,12],[160,13,160,14],[160,15,160,16],[159,0,159,2],[159,3,159,4],[159,5,159,6],[159,7,159,8],[159,9,159,10],[159,11,159,12],[157,13,157,14],[157,15,157,16],[158,0,158,2],[158,3,158,4],[158,5,158,6],[158,7,158,8],[158,9,158,10],[158,11,158,12],[158,13,158,14],[158,15,158,16],[157,0,157,2],[157,3,157,4],[157,5,157,6],[157,7,157,8],[157,9,157,10],[157,11,157,12],[155,13,155,14],[155,15,155,16],[156,0,156,2],[156,3,156,4],[156,5,156,6],[156,7,156,8],[156,9,156,10],[156,11,156,12],[156,13,156,14],[156,15,156,16],[155,0,155,2],[155,3,155,4],[155,5,155,6],[155,7,155,8],[155,9,155,10],[155,11,155,12],[154,3,154,4],[154,5,154,6],[154,7,154,8],[154,9,154,10],[154,11,154,12],[154,13,154,14],[154,15,154,16],[148,3,148,4],[148,5,148,6],[148,7,148,8],[148,9,148,10],[148,11,148,12],[148,13,148,14],[144,15,144,16],[147,3,147,4],[147,5,147,6],[147,7,147,8],[147,9,147,10],[147,11,147,12],[147,13,147,14],[147,15,147,16],[148,15,148,16],[142,15,142,16],[143,0,143,2],[143,3,143,4],[143,5,143,6],[143,7,143,8],[143,9,143,10],[143,11,143,12],[143,13,143,14],[143,15,143,16],[142,0,142,2],[142,3,142,4],[142,5,142,6],[142,7,142,8],[142,9,142,10],[142,11,142,12],[142,13,142,14],[144,0,144,2],[144,3,144,4],[144,5,144,6],[144,7,144,8],[144,9,144,10],[144,11,144,12],[144,13,144,14],[126,15,126,16],[136,0,136,2],[137,0,137,2],[140,0,140,2],[140,9,140,14],[141,0,141,2],[141,3,141,4],[141,5,141,6],[141,7,141,8],[141,9,141,10],[126,3,126,4],[126,5,126,6],[126,7,126,8],[126,9,126,10],[126,11,126,12],[126,13,126,14],[141,11,141,12],[121,3,121,4],[121,5,121,6],[121,7,121,8],[121,9,121,10],[121,11,121,12],[121,13,121,14],[141,13,141,14],[141,15,141,16],[121,15,121,16],[122,3,122,4],[122,5,122,6],[122,7,122,8],[122,9,122,10],[122,11,122,12],[122,13,122,14],[122,15,122,16],[116,0,116,2],[117,0,117,2],[118,0,118,2],[120,3,120,4],[120,5,120,6],[120,7,120,8],[108,0,108,2],[109,0,109,16],[110,0,110,2],[111,0,111,2],[114,0,114,1],[115,0,115,1],[120,9,120,10],[120,11,120,12],[120,13,120,14],[120,15,120,16],[97,0,97,16],[101,0,101,1],[102,0,102,1],[103,0,103,2],[106,0,106,1],[107,0,107,1],[95,13,95,14],[95,15,95,16],[96,3,96,4],[96,5,96,6],[96,7,96,8],[96,9,96,10],[96,11,96,12],[96,13,96,14],[96,15,96,16],[94,7,94,8],[94,9,94,10],[94,11,94,12],[94,13,94,14],[94,15,94,16],[95,3,95,4],[95,5,95,6],[95,7,95,8],[95,9,95,10],[95,11,95,12],[85,1,85,2],[89,1,89,2],[90,1,90,2],[91,1,91,2],[94,3,94,4],[94,5,94,6],[77,1,77,2],[78,1,78,2],[79,1,79,2],[80,0,80,2],[83,1,83,2],[84,1,84,2],[64,15,64,16],[68,1,68,2],[69,1,69,2],[70,1,70,2],[75,1,75,2],[76,1,76,2],[64,3,64,4],[64,5,64,6],[64,7,64,8],[64,9,64,10],[64,11,64,12],[64,13,64,14],[62,15,62,16],[63,3,63,4],[63,5,63,6],[63,7,63,8],[63,9,63,10],[63,11,63,12],[63,13,63,14],[63,15,63,16],[62,3,62,4],[62,5,62,6],[62,7,62,8],[62,9,62,10],[62,11,62,12],[62,13,62,14],[58,15,58,16],[59,3,59,4],[59,5,59,6],[59,7,59,8],[59,9,59,10],[59,11,59,12],[59,13,59,14],[59,15,59,16],[58,3,58,4],[58,5,58,6],[58,7,58,8],[58,9,58,10],[58,11,58,12],[58,13,58,14],[56,15,56,16],[57,3,57,4],[57,5,57,6],[57,7,57,8],[57,9,57,10],[57,11,57,12],[57,13,57,14],[57,15,57,16],[56,3,56,4],[56,5,56,6],[56,7,56,8],[56,9,56,10],[56,11,56,12],[56,13,56,14],[28,13,28,14],[28,15,28,16],[29,0,29,2],[29,3,29,4],[29,5,29,6],[29,7,29,8],[29,9,29,10],[29,11,29,12],[29,13,29,14],[29,15,29,16],[2,13,2,14],[2,15,2,16],[3,3,3,4],[3,5,3,6],[3,7,3,8],[3,9,3,10],[3,11,3,12],[3,13,3,14],[3,15,3,16],[0,0,0,1],[2,3,2,4],[2,5,2,6],[2,7,2,8],[2,9,2,10],[2,11,2,12],[17,0,17,2],[28,3,28,4],[28,5,28,6],[28,7,28,8],[28,9,28,10],[28,11,28,12]]}
[]
[]
["VERKEHRS-, VER- U. ENTSORGUNGSINFRASTRUKTUR",null,null,"HQ",null,"HQ",null,"HQ",null,"HQ",null,"HQ",null,"HQ",null,"HQ"]
[null,null,null,{"$f":"Projektgrunddaten!$C$24","v":0},null,{"$f":"Projektgrunddaten!$C$25","v":0},null,{"$f":"Projektgrunddaten!$C$26","v":0},null,{"$f":"Projektgrunddaten!$C$27","v":0},null,{"$f":"Projektgrunddaten!$C$28","v":0},null,{"$f":"Projektgrunddaten!$C$29","v":100},null,{"$f":"Projektgrunddaten!$C$30","v":0}]
[]
["VERKEHRSINFRASTRUKTUR - STRASSE"]
["Räumungskosten"]
["Straßen (Material in m³)","Kosten in € pro m³\nRichtwert","Kosten in € pro m³\neigene Erhebung","m³","Kosten in €","m³","Kosten in €","m³","Kosten in €","m³","Kosten in €","m³","Kosten in €","m³","Kosten in €","m³","Kosten in €"]
["Autobahn, Schnellstraße \n(4- und mehrspurig, baulich getrennt)",{"$f":"Berechnungsgrundlagen!B29","v":28.135288552507095},null,null,{"$f":"IF(C9>0,C9*D9,B9*D9)","v":0},null,{"$f":"IF(C9>0,C9*F9,B9*F9)","v":0},null,{"$f":"IF(C9>0,C9*H9,B9*H9)","v":0},null,{"$f":"IF(C9>0,C9*J9,B9*J9)","v":0},null,{"$f":"IF(C9>0,C9*L9,B9*L9)","v":0},null,{"$f":"IF(C9>0,C9*N9,B9*N9)","v":0},null,{"$f":"IF(C9>0,C9*P9,B9*P9)","v":0}]
["Landeshauptstraße (4-spurig)",{"$f":"Berechnungsgrundlagen!B30","v":22.018921475875118},null,null,0,null,0,null,0,null,0,null,0,null,0,null,0]
["Landesstraße (2-spurig)",{"$f":"Berechnungsgrundlagen!B31","v":22.018921475875118},null,null,0,null,0,null,0,null,0,null,0,null,0,null,0]
["Gemeindestraßen (2-spurig)",{"$f":"Berechnungsgrundlagen!B32","v":22.018921475875118},null,null,0,null,0,null,0,null,0,null,0,null,0,null,0]
["Sonstige Wege",{"$f":"Berechnungsgrundlagen!B33","v":14.679280983916748},null,null,0,null,0,null,0,null,0,null,0,null,0,null,0]
["Parkplätze",12,null,null,0,null,0,null,0,null,0,null,0,null,0,null,0]
["Andere",null,null,null,{"$f":"C15*D15","v":0},null,{"$f":"C15*F15","v":0},null,{"$f":"C15*H15","v":0},null,{"$f":"C15*J15","v":0},null,{"$f":"C15*L15","v":0},null,{"$f":"C15*N15","v":0},null,{"$f":"C15*P15","v":0}]
["Summe Räumung Straße",null,null,{"$f":"SUM(D9:D15)","v":0},0,0,0,{"$f":"SUM(H9:H15)","v":0},{"$f":"SUM(I9:I15)","v":0},0,0,0,0,0,0,0,0]
[]
["Reinigungskosten \n(NUR, wenn keine Räumungskosten angesetzt werden!)"]
["Straßen (Material in m2)","Kosten in € pro m2\nRichtwert","Kosten in € pro m2\neigene Erhebung","m2","Kosten in €","m2","Kosten in €","m2","Kosten in €","m2","Kosten in €","m2","Kosten in €","m2","Kosten in €","m2","Kosten in €"]
["Autobahn, Schnellstraße \n(4- und mehrspurig, baulich getrennt)",{"$f":"Berechnungsgrundlagen!C29","v":3.6698202459791869},null,null,{"$f":"IF(E9>0,0,IF(C20>0,C20*D20,B20*D20))","v":0},null,{"$f":"IF(G9>0,0,IF(C20>0,C20*F20,B20*F20))","v":0},null,{"$f":"IF(I9>0,0,IF(C20>0,C20*H20,B20*H20))","v":0},null,{"$f":"IF(K9>0,0,IF(C20>0,C20*J20,B20*J20))","v":0},null,{"$f":"IF(M9>0,0,IF(C20>0,C20*L20,B20*L20))","v":0},null,{"$f":"IF(O9>0,0,IF(C20>0,C20*N20,B20*N20))","v":0},null,{"$f":"IF(Q9>0,0,IF(C20>0,C20*P20,B20*P20))","v":0}]
["Landeshauptstraße (4-spurig)",{"$f":"Berechnungsgrundlagen!C30","v":3.6698202459791869},null,null,0,null,0,null,0,null,0,null,0,null,0,null,0]
["Landesstraße (2-spurig)",{"$f":"Berechnungsgrundlagen!C31","v":2.4465468306527911},null,null,0,null,0,null,0,null,0,null,0,null,0,null,0]
["Gemeindestraßen (2-spurig)",{"$f":"Berechnungsgrundlagen!C32","v":2.4465468306527911},null,null,0,null,0,null,0,null,0,null,0,null,0,null,0]
["Sonstige Wege",{"$f":"Berechnungsgrundlagen!C33","v":2.4465468306527911},null,null,0,null,0,null,0,null,0,null,0,null,0,null,0]
["Parkplätze",2,null,null,0,null,0,null,0,null,0,null,0,null,0,null,0]
["Andere",null,null,null,{"$f":"IF(E15>0,0,C26*D26)","v":0},null,{"$f":"IF(G15>0,0,C26*F26)","v":0},null,{"$f":"IF(I15>0,0,C26*H26)","v":0},null,{"$f":"IF(K15>0,0,C26*J26)","v":0},null,{"$f":"IF(M15>0,0,C26*L26)","v":0},null,{"$f":"IF(O15>0,0,C26*N26)","v":0},null,{"$f":"IF(Q15>0,0,C26*P26)","v":0}]
["Summe Reinigungskosten Straße",null,null,{"$f":"SUM(D20:D26)","v":0},{"$f":"SUM(E20:E26)","v":0},0,{"$f":"SUM(G20:G26)","v":0},0,{"$f":"SUM(I20:I26)","v":0},0,{"$f":"SUM(K20:K26)","v":0},0,{"$f":"SUM(M20:M26)","v":0},0,{"$f":"SUM(O20:O26)","v":0},0,{"$f":"SUM(Q20:Q26)","v":0}]
[]
["Reparaturkosten",null,null,"eigene Schätzung",null,"eigene Schätzung",null,"eigene Schätzung",null,"eigene Schätzung",null,"eigene Schätzung",null,"eigene Schätzung",null,"eigene Schätzung"]
["Anfälligkeitsgrad (0  = keine, 1 = volle Anfälligkeit); Eingabe zwingend erforderlich!"]
[null,"Kosten in € pro lfm\nRichtwert","Kosten in € pro lfm\neigene Erhebung","lfm","Kosten in €","lfm","Kosten in €","lfm","Kosten in €","lfm","Kosten in €","lfm","Kosten in €","lfm","Kosten in €","lfm","Kosten in €"]
["Autobahn, Schnellstraße \n(4- und mehrspurig, baulich getrennt)",{"$f":"ROUND(Berechnungsgrundlagen!D29,0)","v":3150},null,null,{"$f":"IF(C32>0,C32*D32,B32*D32)*$D$30","v":0},null,{"$f":"IF(C32>0,C32*F32,B32*F32)*$F$30","v":0},null,{"$f":"IF(C32>0,C32*H32,B32*H32)*$H$30","v":0},null,{"$f":"IF(C32>0,C32*J32,B32*J32)*$J$30","v":0},null,{"$f":"IF(C32>0,C32*L32,B32*L32)*$L$30","v":0},null,{"$f":"IF(C32>0,C32*N32,B32*N32)*$N$30","v":0},null,{"$f":"IF(C32>0,C32*P32,B32*P32)*$P$30","v":0}]
["Landeshauptstraße (4-spurig)",{"$f":"ROUND(Berechnungsgrundlagen!D30,0)","v":859},null,null,0,null,0,null,0,null,0,null,0,null,0,null,0]
["Landesstraße (2-spurig)",{"$f":"ROUND(Berechnungsgrundlagen!D31,0)","v":645},null,null,0,null,0,null,0,null,0,null,0,null,0,null,0]
["Gemeindestraßen (2-spurig)",{"$f":"ROUND(Berechnungsgrundlagen!D32,0)","v":645},null,null,0,null,0,null,0,null,0,null,0,null,0,null,0]
["Sonstige Wege",{"$f":"ROUND(Berechnungsgrundlagen!D33,0)","v":15},null,null,0,null,0,null,0,null,0,null,0,null,0,null,0]
["Andere",null,null,null,0,null,0,null,0,null,0,null,0,null,0,null,0]
["Summe Reparaturkosten Straße",null,null,{"$f":"SUM(D32:D37)","v":0},0,0,0,0,0,0,0,0,0,0,0,0,0]
[]
["Straßensperren"]
[null,"€/Tag\nRichtwert","€/Tag\neigene Erhebung","Tage","Kosten in €","Tage","Kosten in €","Tage","Kosten in €","Tage","Kosten in €","Tage","Kosten in €","Tage","Kosten in €","Tage","Kosten in €"]
["Autobahn, Schnellstraße \n(4- und mehrspurig, baulich getrennt)",{"$f":"Berechnungsgrundlagen!C42","v":82941.607379375593},null,null,{"$f":"IF(C42>0,C42*D42,B42*D42)","v":0},null,{"$f":"IF(C42>0,C42*F42,B42*F42)","v":0},null,{"$f":"IF(C42>0,C42*H42,B42*H42)","v":0},null,{"$f":"IF(C42>0,C42*J42,B42*J42)","v":0},null,{"$f":"IF(C42>0,C42*L42,B42*L42)","v":0},null,{"$f":"IF(C42>0,C42*N42,B42*N42)","v":0},null,{"$f":"IF(C42>0,C42*P42,B42*P42)","v":0}]
["Landeshauptstraße (4-spurig)",{"$f":"Berechnungsgrundlagen!C43","v":55294.404919583729},null,null,0,null,0,null,0,null,0,null,0,null,0,null,0]
["Landesstraße (2-spurig)",{"$f":"Berechnungsgrundlagen!C44","v":41470.192052980135},null,null,0,null,0,null,0,null,0,null,0,null,0,null,0]
["Gemeindestraßen (2-spurig)",{"$f":"Berechnungsgrundlagen!C45","v":27647.202459791864},null,null,0,null,0,null,0,null,0,null,0,null,0,null,0]
["Sonstige Wege",{"$f":"Berechnungsgrundlagen!C46","v":3455.7473982970673},null,null,0,null,0,null,0,null,0,null,0,null,0,null,0]
["Andere",null,null,null,0,null,0,null,0,null,0,null,0,null,0,null,0]
["Summe Sperre Straße",null,null,{"$f":"SUM(D42:D47)","v":0},0,0,0,0,0,0,0,0,0,0,0,0,0]
[]
["Umleitungskosten und Mautentgang"]
["Umleitungskosten","€/km\nRichtwert","€/km\neigene Erhebung","Länge Umweg in km","PKW Einheiten\ngesamt","Länge Umweg in km","PKW Einheiten\ngesamt","Länge Umweg in km","PKW Einheiten\ngesamt","Länge Umweg in km","PKW Einheiten\ngesamt","Länge Umweg in km","PKW Einheiten\ngesamt","Länge Umweg in km","PKW Einheiten\ngesamt","Länge Umweg in km","PKW Einheiten\ngesamt"]
["Straße A",{"$f":"Berechnungsgrundlagen!B68","v":0.52116682738669229}]
["Straße B",{"$f":"Berechnungsgrundlagen!B68","v":0.52116682738669229}]
["Straße C",{"$f":"Berechnungsgrundlagen!B68","v":0.52116682738669229}]
["Straße D",{"$f":"Berechnungsgrundlagen!B68","v":0.52116682738669229}]
["Straße E",{"$f":"Berechnungsgrundlagen!B68","v":0.52116682738669229}]
["Mautentgang",null,"€/km\neigene Erhebung","Länge Mautstraße in km",null,"Länge Mautstraße in km",null,"Länge Mautstraße in km",null,"Länge Mautstraße in km",null,"Länge Mautstraße in km",null,"Länge Mautstraße in km",null,"Länge Mautstraße in km"]
["Mautstraße A"]
["Mautstraße B"]
["Mautstraße C"]
["Summe Umleitungskosten und Mautentgang Straße",null,null,{"$f":"SUM(D58:D60)","v":0},{"$f":"SUM((IF($C$52>0,$C$52*D52*E52,$B$52*D52*E52))+(IF($C$53>0,$C$53*D53*E53,$B$53*D53*E53)))+(IF($C$54>0,$C$54*D54*E54,$B$54*D54*E54))+(IF($C$55>0,$C$55*D55*E55,$B$55*D55*E55))+(IF($C$56>0,$C$56*D56*E56,$B$56*D56*E56))+SUMPRODUCT(C58:C60,D58:D60)","v":0},{"$f":"SUM(F58:F60)","v":0},{"$f":"SUM((IF($C$52>0,$C$52*F52*G52,$B$52*F52*G52))+(IF($C$53>0,$C$53*F53*G53,$B$53*F53*G53)))+(IF($C$54>0,$C$54*F54*G54,$B$54*F54*G54))+(IF($C$55>0,$C$55*F55*G55,$B$55*F55*G55))+(IF($C$56>0,$C$56*F56*G56,$B$56*F56*G56))+SUMPRODUCT(C58:C60,F58:F60)","v":0},{"$f":"SUM(H58:H60)","v":0},{"$f":"SUM((IF($C$52>0,$C$52*H52*I52,$B$52*H52*I52))+(IF($C$53>0,$C$53*H53*I53,$B$53*H53*I53)))+(IF($C$54>0,$C$54*H54*I54,$B$54*H54*I54))+(IF($C$55>0,$C$55*H55*I55,$B$55*H55*I55))+(IF($C$56>0,$C$56*H56*I56,$B$56*H56*I56))+SUMPRODUCT(C58:C60,H58:H60)","v":0},{"$f":"SUM(J58:J60)","v":0},{"$f":"SUM((IF($C$52>0,$C$52*J52*K52,$B$52*J52*K52))+(IF($C$53>0,$C$53*J53*K53,$B$53*J53*K53)))+(IF($C$54>0,$C$54*J54*K54,$B$54*J54*K54))+(IF($C$55>0,$C$55*J55*K55,$B$55*J55*K55))+(IF($C$56>0,$C$56*J56*K56,$B$56*J56*K56))+SUMPRODUCT(C58:C60,J58:J60)","v":0},{"$f":"SUM(L58:L60)","v":0},{"$f":"SUM((IF($C$52>0,$C$52*L52*M52,$B$52*L52*M52))+(IF($C$53>0,$C$53*L53*M53,$B$53*L53*M53)))+(IF($C$54>0,$C$54*L54*M54,$B$54*L54*M54))+(IF($C$55>0,$C$55*L55*M55,$B$55*L55*M55))+(IF($C$56>0,$C$56*L56*M56,$B$56*L56*M56))+SUMPRODUCT(C58:C60,L58:L60)","v":0},{"$f":"SUM(N58:N60)","v":0},{"$f":"SUM((IF($C$52>0,$C$52*N52*O52,$B$52*N52*O52))+(IF($C$53>0,$C$53*N53*O53,$B$53*N53*O53)))+(IF($C$54>0,$C$54*N54*O54,$B$54*N54*O54))+(IF($C$55>0,$C$55*N55*O55,$B$55*N55*O55))+(IF($C$56>0,$C$56*N56*O56,$B$56*N56*O56))+SUMPRODUCT(C58:C60,N58:N60)","v":0},{"$f":"SUM(P58:P60)","v":0},{"$f":"SUM((IF($C$52>0,$C$52*P52*Q52,$B$52*P52*Q52))+(IF($C$53>0,$C$53*P53*Q53,$B$53*P53*Q53)))+(IF($C$54>0,$C$54*P54*Q54,$B$54*P54*Q54))+(IF($C$55>0,$C$55*P55*Q55,$B$55*P55*Q55))+(IF($C$56>0,$C$56*P56*Q56,$B$56*P56*Q56))+SUMPRODUCT(C58:C60,P58:P60)","v":0}]
[]
[null,null,null,"HQ",null,"HQ",null,"HQ",null,"HQ",null,"HQ",null,"HQ",null,"HQ"]
[null,null,null,{"$f":"Projektgrunddaten!$C$24","v":0},null,{"$f":"Projektgrunddaten!$C$25","v":0},null,{"$f":"Projektgrunddaten!$C$26","v":0},null,{"$f":"Projektgrunddaten!$C$27","v":0},null,{"$f":"Projektgrunddaten!$C$28","v":0},null,{"$f":"Projektgrunddaten!$C$29","v":100},null,{"$f":"Projektgrunddaten!$C$30","v":0}]
["STRASSE SCHADENSANFÄLLIGKEIT GESAMT",null,null,{"$f":"SUM(E61+E48+E38+E27+E16)","v":0},null,{"$f":"SUM(G61+G48+G38+G27+G16)","v":0},null,{"$f":"SUM(I61+I48+I38+I27+I16)","v":0},null,{"$f":"SUM(K61+K48+K38+K27+K16)","v":0},null,{"$f":"SUM(M61+M48+M38+M27+M16)","v":0},null,{"$f":"SUM(O61+O48+O38+O27+O16)","v":0},null,{"$f":"SUM(Q61+Q48+Q38+Q27+Q16)","v":0}]
[]
["VERKEHRSINFRASTRUKTUR - BAHN"]
["Räumungs- und Reinigungskosten"]
["Bahn (Material pro lfm)","Kosten in € pro lfm",null," lfm","Kosten in €"," lfm","Kosten in €"," lfm","Kosten in €"," lfm","Kosten in €"," lfm","Kosten in €"," lfm","Kosten in €"," lfm","Kosten in €"]
["Bahn 1-gleisig",{"$f":"Berechnungsgrundlagen!B35","v":72.173131504257341},null,null,{"$f":"B70*D70","v":0},null,{"$f":"B70*F70","v":0},null,{"$f":"B70*H70","v":0},null,{"$f":"B70*J70","v":0},null,{"$f":"B70*L70","v":0},null,{"$f":"B70*N70","v":0},null,{"$f":"B70*P70","v":0}]
["Bahn 2-gleisig",{"$f":"Berechnungsgrundlagen!B36","v":143.12298959318827},null,null,{"$f":"B71*D71","v":0},null,{"$f":"B71*F71","v":0},null,{"$f":"B71*H71","v":0},null,{"$f":"B71*J71","v":0},null,{"$f":"B71*L71","v":0},null,{"$f":"B71*N71","v":0},null,{"$f":"B71*P71","v":0}]
["Summe Räumungs- und Reinigungskosten Bahn",null,null,{"$f":"SUM(D70:D71)","v":0},0,0,0,{"$f":"SUM(H70:H71)","v":0},{"$f":"SUM(I70:I71)","v":0},0,0,0,0,0,0,0,0]
[]
["Schadensfeststellung und Betriebsbehinderungen"]
[null,null,null,"Achtung: Diese Kosten nur einmalig pro HQ-Ereignis ansetzen!",null,null,null,null,null,{"$f":"+D75","v":"Achtung: Diese Kosten nur einmalig pro HQ-Ereignis ansetzen!"}]
["Schadensfeststellung",{"$f":"Berechnungsgrundlagen!F29","v":2003.7218543046358},null,null,{"$f":"IF(COUNTA(D76)>0,$B$76,0)","v":0},null,{"$f":"IF(COUNTA(F76)>0,$B$76,0)","v":0},null,{"$f":"IF(COUNTA(H76)>0,$B$76,0)","v":0},null,{"$f":"IF(COUNTA(J76)>0,$B$76,0)","v":0},null,{"$f":"IF(COUNTA(L76)>0,$B$76,0)","v":0},null,{"$f":"IF(COUNTA(N76)>0,$B$76,0)","v":0},null,{"$f":"IF(COUNTA(P76)>0,$B$76,0)","v":0}]
[null,"Kosten in € \npro Tag",null,"Anzahl \nTage","Kosten in €","Anzahl \nTage","Kosten in €","Anzahl \nTage","Kosten in €","Anzahl \nTage","Kosten in €","Anzahl \nTage","Kosten in €","Anzahl \nTage","Kosten in €","Anzahl \nTage","Kosten in €"]
["Überwachung",{"$f":"Berechnungsgrundlagen!F31","v":2291.191106906339},null,null,{"$f":"B78*D78","v":0},null,{"$f":"B78*F78","v":0},null,{"$f":"B78*H78","v":0},null,{"$f":"B78*J78","v":0},null,{"$f":"B78*L78","v":0},null,{"$f":"N78*B78","v":0},null,{"$f":"B78*P78","v":0}]
["Langsamfahren \n1-gleisige Strecke",{"$f":"Berechnungsgrundlagen!F32","v":4008.6669820245979},null,null,{"$f":"B79*D79","v":0},null,{"$f":"B79*F79","v":0},null,{"$f":"B79*H79","v":0},null,{"$f":"B79*J79","v":0},null,{"$f":"B79*L79","v":0},null,{"$f":"N79*B79","v":0},null,{"$f":"B79*P79","v":0}]
["Langsamfahren \n2-gleisige Strecke",{"$f":"Berechnungsgrundlagen!F33","v":9734.8098391674557},null,null,{"$f":"B80*D80","v":0},null,{"$f":"B80*F80","v":0},null,{"$f":"B80*H80","v":0},null,{"$f":"B80*J80","v":0},null,{"$f":"B80*L80","v":0},null,{"$f":"N80*B80","v":0},null,{"$f":"B80*P80","v":0}]
["Summe Schadensfeststellung und Betriebsbehinderungen Bahn",null,null,{"$f":"SUM(D78:D80)","v":0},{"$f":"SUM(E78:E80)+E76","v":0},{"$f":"SUM(F78:F80)","v":0},{"$f":"SUM(G78:G80)+G76","v":0},{"$f":"SUM(H78:H80)","v":0},{"$f":"SUM(I78:I80)+I76","v":0},{"$f":"SUM(J78:J80)","v":0},{"$f":"SUM(K78:K80)+K76","v":0},{"$f":"SUM(L78:L80)","v":0},{"$f":"SUM(M78:M80)+M76","v":0},{"$f":"SUM(N78:N80)","v":0},{"$f":"SUM(O78:O80)+O76","v":0},{"$f":"SUM(P78:P80)","v":0},{"$f":"SUM(Q78:Q80)+Q76","v":0}]
[]
["Reparaturkosten"]
[null,"Kosten in € pro lfm",null,"lfm","Kosten in €","lfm","Kosten in €","lfm","Kosten in €","lfm","Kosten in €","lfm","Kosten in €","lfm","Kosten in €","lfm","Kosten in €"]
["Bahn 1-gleisig",{"$f":"Berechnungsgrundlagen!D35","v":4294.9129612109746},null,null,{"$f":"B85*D85","v":0},null,{"$f":"B85*F85","v":0},null,{"$f":"B85*H85","v":0},null,{"$f":"B85*J85","v":0},null,{"$f":"B85*L85","v":0},null,{"$f":"B85*N85","v":0},null,{"$f":"B85*P85","v":0}]
["Bahn 2-gleisig",{"$f":"Berechnungsgrundlagen!D36","v":8589.8259224219491},null,null,{"$f":"B86*D86","v":0},null,{"$f":"B86*F86","v":0},null,{"$f":"B86*H86","v":0},null,{"$f":"B86*J86","v":0},null,{"$f":"B86*L86","v":0},null,{"$f":"B86*N86","v":0},null,{"$f":"B86*P86","v":0}]
["Summe Reparaturkosten Bahn",null,null,{"$f":"SUM(D85:D86)","v":0},0,0,0,{"$f":"SUM(H85:H86)","v":0},{"$f":"SUM(I85:I86)","v":0},0,0,0,0,0,0,0,0]
[]
["Sperren"]
[null,"€/Tag",null,"Tage","Kosten in €","Tage","Kosten in €","Tage","Kosten in €","Tage","Kosten in €","Tage","Kosten in €","Tage","Kosten in €","Tage","Kosten in €"]
["Bahn 1-gleisig",{"$f":"Berechnungsgrundlagen!C48","v":51838.657521286659},null,null,{"$f":"B91*D91","v":0},null,{"$f":"B91*F91","v":0},null,{"$f":"H91*B91","v":0},null,{"$f":"J91*B91","v":0},null,{"$f":"B91*L91","v":0},null,{"$f":"N91*B91","v":0},null,{"$f":"P91*B91","v":0}]
["Bahn 2-gleisig",{"$f":"Berechnungsgrundlagen!C49","v":57367.853358561973},null,null,{"$f":"B92*D92","v":0},null,{"$f":"B92*F92","v":0},null,{"$f":"H92*B92","v":0},null,{"$f":"J92*B92","v":0},null,{"$f":"B92*L92","v":0},null,{"$f":"N92*B92","v":0},null,{"$f":"P92*B92","v":0}]
["Summe Sperre Bahn",null,null,{"$f":"SUM(D91:D92)","v":0},0,0,0,{"$f":"SUM(H91:H92)","v":0},{"$f":"SUM(I91:I92)","v":0},0,0,0,0,0,0,0,0]
[]
[null,null,null,"HQ",null,"HQ",null,"HQ",null,"HQ",null,"HQ",null,"HQ",null,"HQ"]
[null,null,null,{"$f":"Projektgrunddaten!$C$24","v":0},null,{"$f":"Projektgrunddaten!$C$25","v":0},null,{"$f":"Projektgrunddaten!$C$26","v":0},null,{"$f":"Projektgrunddaten!$C$27","v":0},null,{"$f":"Projektgrunddaten!$C$28","v":0},null,{"$f":"Projektgrunddaten!$C$29","v":100},null,{"$f":"Projektgrunddaten!$C$30","v":0}]
["BAHN - SCHADENSANFÄLLIGKEIT GESAMT",null,null,{"$f":"SUM(E93+E87+E81+E72)","v":0},null,{"$f":"SUM(G93+G87+G81+G72)","v":0},null,{"$f":"SUM(I93+I87+I81+I72)","v":0},null,{"$f":"SUM(K93+K87+K81+K72)","v":0},null,{"$f":"SUM(M93+M87+M81+M72)","v":0},null,{"$f":"SUM(O93+O87+O81+O72)","v":0},null,{"$f":"SUM(Q93+Q87+Q81+Q72)","v":0}]
[]
["VERKEHRSINFRASTRUKTUR und"]
["SONSTIGE VERKEHRSANLAGEN"]
["Räumungskosten",null,"Kosten in € pro m³\neigene Erhebung","m³","Kosten in €","m³","Kosten in €","m³","Kosten in €","m³","Kosten in €","m³","Kosten in €","m³","Kosten in €","m³","Kosten in €"]
["Flugbetriebsflächen",null,null,null,{"$f":"C102*D102","v":0},null,{"$f":"C102*F102","v":0},null,{"$f":"H102*C102","v":0},null,{"$f":"J102*C102","v":0},null,{"$f":"C102*L102","v":0},null,{"$f":"C102*N102","v":0},null,{"$f":"C102*P102","v":0}]
["Schifffahrtseinrichtungen",null,null,null,{"$f":"C103*D103","v":0},null,{"$f":"C103*F103","v":0},null,{"$f":"H103*C103","v":0},null,{"$f":"J103*C103","v":0},null,{"$f":"C103*L103","v":0},null,{"$f":"C103*N103","v":0},null,{"$f":"C103*P103","v":0}]
["Summe Räumungskosten Sonstige Verkehrsanlagen",null,null,{"$f":"SUM(D102:D103)","v":0},0,0,0,{"$f":"SUM(H102:H103)","v":0},{"$f":"SUM(I102:I103)","v":0},0,0,0,0,0,0,0,0]
[]
["Reparaturkosten",null,"Kosten in € pro m²\neigene Erhebung","m²","Kosten in €","m²","Kosten in €","m²","Kosten in €","m²","Kosten in €","m²","Kosten in €","m²","Kosten in €","m²","Kosten in €"]
["Flugbetriebsflächen",null,null,null,{"$f":"C107*D107","v":0},null,{"$f":"C107*F107","v":0},null,{"$f":"H107*C107","v":0},null,{"$f":"J107*C107","v":0},null,{"$f":"L107*C107","v":0},null,{"$f":"N107*C107","v":0},null,{"$f":"P107*C107","v":0}]
["Schifffahrtseinrichtungen",null,null,null,{"$f":"C108*D108","v":0},null,{"$f":"C108*F108","v":0},null,{"$f":"H108*C108","v":0},null,{"$f":"J108*C108","v":0},null,{"$f":"L108*C108","v":0},null,{"$f":"N108*C108","v":0},null,{"$f":"P108*C108","v":0}]
["Summe Reparaturkosten Sonstige Verkehrsanlagen",null,null,{"$f":"SUM(D107:D108)","v":0},0,0,0,{"$f":"SUM(H107:H108)","v":0},{"$f":"SUM(I107:I108)","v":0},0,0,0,0,0,0,0,0]
[]
["Erläuterungen zu den Reparaturkosten Sonstige Verkehrsanlagen"]
[]
[]
["Sperren",null,"€/Tag\neigene Erhebung","Tage","Kosten in €","Tage","Kosten in €","Tage","Kosten in €","Tage","Kosten in €","Tage","Kosten in €","Tage","Kosten in €","Tage","Kosten in €"]
["Flugbetriebsflächen",null,null,null,{"$f":"C115*D115","v":0},null,{"$f":"C115*F115","v":0},null,{"$f":"C115*H115","v":0},null,{"$f":"C115*J115","v":0},null,{"$f":"C115*L115","v":0},null,{"$f":"C115*N115","v":0},null,{"$f":"C115*P115","v":0}]
["Schifffahrtseinrichtungen",null,null,null,{"$f":"C116*D116","v":0},null,{"$f":"C116*F116","v":0},null,{"$f":"C116*H116","v":0},null,{"$f":"C116*J116","v":0},null,{"$f":"C116*L116","v":0},null,{"$f":"C116*N116","v":0},null,{"$f":"C116*P116","v":0}]
["Summe Sperre Sonstige Verkehrsanlagen",null,null,{"$f":"SUM(D115:D116)","v":0},0,0,0,{"$f":"SUM(H115:H116)","v":0},{"$f":"SUM(I115:I116)","v":0},0,0,0,0,0,0,0,0]
["Erläuterungen zur Kalkulation Sperren Sonstige Verkehrsanlagen"]
[]
[]
[null,null,null,"HQ",null,"HQ",null,"HQ",null,"HQ",null,"HQ",null,"HQ",null,"HQ"]
["SCHADENSANFÄLLIGKEIT ",null,null,{"$f":"Projektgrunddaten!$C$24","v":0},null,{"$f":"Projektgrunddaten!$C$25","v":0},null,{"$f":"Projektgrunddaten!$C$26","v":0},null,{"$f":"Projektgrunddaten!$C$27","v":0},null,{"$f":"Projektgrunddaten!$C$28","v":0},null,{"$f":"Projektgrunddaten!$C$29","v":100},null,{"$f":"Projektgrunddaten!$C$30","v":0}]
["SONSTIGE VERKEHRSANLAGEN GESAMT",null,null,{"$f":"SUM(E117+E109+E104)","v":0},null,{"$f":"SUM(G117+G109+G104)","v":0},null,{"$f":"SUM(I117+I109+I104)","v":0},null,{"$f":"SUM(K117+K109+K104)","v":0},null,{"$f":"SUM(M117+M109+M104)","v":0},null,{"$f":"SUM(O117+O109+O104)","v":0},null,{"$f":"SUM(Q117+Q109+Q104)","v":0}]
[]
["BRÜCKEN"]
["Reparatur- / Neubaukosten",null,"Anfälligkeitsgrad:"]
["Richtwert \nNeubau Brücke in €/m²",{"$f":"Berechnungsgrundlagen!B70","v":2288.4071630537233},"0 = keine Anfälligkeit\n1 = volle Anfälligkeit"]
["Alternative Eingabe:","Fläche in m²","Neubaukosten/\nReparaturkosten","Anfällig-keit\n0 - 1","Kosten in €","Anfällig-keit\n0 - 1","Kosten in €","Anfällig-keit\n0 - 1","Kosten in €","Anfällig-keit\n0 - 1","Kosten in €","Anfällig-keit\n0 - 1","Kosten in €","Anfällig-keit\n0 - 1","Kosten in €","Anfällig-keit\n0 - 1","Kosten in €"]
["Brücke 1",null,null,null,{"$f":"IF($C$129=0,$B$129*$B$127,$C$129)*(IF(D129=\"\",0,D129))","v":0},null,{"$f":"IF($C$129=0,$B$129*$B$127,$C$129)*(IF(F129=\"\",0,F129))","v":0},null,{"$f":"IF($C$129=0,$B$129*$B$127,$C$129)*(IF(H129=\"\",0,H129))","v":0},null,{"$f":"IF($C$129=0,$B$129*$B$127,$C$129)*(IF(J129=\"\",0,J129))","v":0},null,{"$f":"IF($C$129=0,$B$129*$B$127,$C$129)*(IF(L129=\"\",0,L129))","v":0},null,{"$f":"IF($C$129=0,$B$129*$B$127,$C$129)*(IF(N129=\"\",0,N129))","v":0},null,{"$f":"IF($C$129=0,$B$129*$B$127,$C$129)*(IF(P129=\"\",0,P129))","v":0}]
["Brücke 2",null,null,null,{"$f":"IF($C$130=0,$B$130*$B$127,$C$130)*(IF(D130=\"\",0,D130))","v":0},null,{"$f":"IF($C$130=0,$B$130*$B$127,$C$130)*(IF(F130=\"\",0,F130))","v":0},null,{"$f":"IF($C$130=0,$B$130*$B$127,$C$130)*(IF(H130=\"\",0,H130))","v":0},null,{"$f":"IF($C$130=0,$B$130*$B$127,$C$130)*(IF(J130=\"\",0,J130))","v":0},null,{"$f":"IF($C$130=0,$B$130*$B$127,$C$130)*(IF(L130=\"\",0,L130))","v":0},null,{"$f":"IF($C$130=0,$B$130*$B$127,$C$130)*(IF(N130=\"\",0,N130))","v":0},null,{"$f":"IF($C$130=0,$B$130*$B$127,$C$130)*(IF(P130=\"\",0,P130))","v":0}]
["Brücke 3",null,null,null,{"$f":"IF($C$131=0,$B$131*$B$127,$C$131)*(IF(D131=\"\",0,D131))","v":0},null,{"$f":"IF($C$131=0,$B$131*$B$127,$C$131)*(IF(F131=\"\",0,F131))","v":0},null,{"$f":"IF($C$131=0,$B$131*$B$127,$C$131)*(IF(H131=\"\",0,H131))","v":0},null,{"$f":"IF($C$131=0,$B$131*$B$127,$C$131)*(IF(J131=\"\",0,J131))","v":0},null,{"$f":"IF($C$131=0,$B$131*$B$127,$C$131)*(IF(L131=\"\",0,L131))","v":0},null,{"$f":"IF($C$131=0,$B$131*$B$127,$C$131)*(IF(N131=\"\",0,N131))","v":0},null,{"$f":"IF($C$131=0,$B$131*$B$127,$C$131)*(IF(P131=\"\",0,P131))","v":0}]
["Brücke 4",null,null,null,{"$f":"IF($C$132=0,$B$132*$B$127,$C$132)*(IF(D132=\"\",0,D132))","v":0},null,{"$f":"IF($C$132=0,$B$132*$B$127,$C$132)*(IF(F132=\"\",0,F132))","v":0},null,{"$f":"IF($C$132=0,$B$132*$B$127,$C$132)*(IF(H132=\"\",0,H132))","v":0},null,{"$f":"IF($C$132=0,$B$132*$B$127,$C$132)*(IF(J132=\"\",0,J132))","v":0},null,{"$f":"IF($C$132=0,$B$132*$B$127,$C$132)*(IF(L132=\"\",0,L132))","v":0},null,{"$f":"IF($C$132=0,$B$132*$B$127,$C$132)*(IF(N132=\"\",0,N132))","v":0},null,{"$f":"IF($C$132=0,$B$132*$B$127,$C$132)*(IF(P132=\"\",0,P132))","v":0}]
["Brücke 5",null,null,null,{"$f":"IF($C$133=0,$B$133*$B$127,$C$133)*(IF(D133=\"\",0,D133))","v":0},null,{"$f":"IF($C$133=0,$B$133*$B$127,$C$133)*(IF(F133=\"\",0,F133))","v":0},null,{"$f":"IF($C$133=0,$B$133*$B$127,$C$133)*(IF(H133=\"\",0,H133))","v":0},null,{"$f":"IF($C$133=0,$B$133*$B$127,$C$133)*(IF(J133=\"\",0,J133))","v":0},null,{"$f":"IF($C$133=0,$B$133*$B$127,$C$133)*(IF(L133=\"\",0,L133))","v":0},null,{"$f":"IF($C$133=0,$B$133*$B$127,$C$133)*(IF(N133=\"\",0,N133))","v":0},null,{"$f":"IF($C$133=0,$B$133*$B$127,$C$133)*(IF(P133=\"\",0,P133))","v":0}]
["Brücke 6",null,null,null,{"$f":"IF($C$134=0,$B$129*$B$134,$C$134)*(IF(D134=\"\",0,D134))","v":0},null,{"$f":"IF($C$134=0,$B$134*$B$127,$C$134)*(IF(F134=\"\",0,F134))","v":0},null,{"$f":"IF($C$134=0,$B$134*$B$127,$C$134)*(IF(H134=\"\",0,H134))","v":0},null,{"$f":"IF($C$134=0,$B$134*$B$127,$C$134)*(IF(J134=\"\",0,J134))","v":0},null,{"$f":"IF($C$134=0,$B$134*$B$127,$C$134)*(IF(L134=\"\",0,L134))","v":0},null,{"$f":"IF($C$134=0,$B$134*$B$127,$C$134)*(IF(N134=\"\",0,N134))","v":0},null,{"$f":"IF($C$134=0,$B$134*$B$127,$C$134)*(IF(P134=\"\",0,P134))","v":0}]
["Summe Reparatur-/Neubaukosten Brücke",null,null,null,{"$f":"SUM(E129:E134)","v":0},null,{"$f":"SUM(G129:G134)","v":0},null,{"$f":"SUM(I129:I134)","v":0},null,{"$f":"SUM(K129:K134)","v":0},null,{"$f":"SUM(M129:M134)","v":0},null,{"$f":"SUM(O129:O134)","v":0},null,{"$f":"SUM(Q129:Q134)","v":0}]
[]
["Erläuterungen zu den Neubau- und Reparaturkosten von Brücken"]
[]
[]
["KRAFTFAHRZEUGE"]
["Abstellbereiche:",null,null,"Anzahl potenziell vorhandener PKW-Abstellplätze in den Bereichen 1 - 3",null,null,null,null,null,{"$f":"+D141","v":"Anzahl potenziell vorhandener PKW-Abstellplätze in den Bereichen 1 - 3"}]
["Bereich 1\nÜberflutungshöhe > 50 cm und Fließgeschwindigkeit <  1m/s"]
["Bereich 2 \nÜberflutungshöhe > 50 cm und  Fließgeschwindigkeit > 1 m/s bzw. unzureichende Reaktionszeit"]
["Bereich 3 \nTiefgaragen"]
["Summe Schadensanfälligkeit KFZ",null,null,{"$f":"(SUMPRODUCT(D142:D144,Berechnungsgrundlagen!$B$55:$B$57))*(Berechnungsgrundlagen!$B$53)","v":0},null,{"$f":"(SUMPRODUCT(F142:F144,Berechnungsgrundlagen!$B$55:$B$57))*(Berechnungsgrundlagen!$B$53)","v":0},null,{"$f":"(SUMPRODUCT(H142:H144,Berechnungsgrundlagen!$B$55:$B$57))*(Berechnungsgrundlagen!$B$53)","v":0},null,{"$f":"(SUMPRODUCT(J142:J144,Berechnungsgrundlagen!$B$55:$B$57))*(Berechnungsgrundlagen!$B$53)","v":0},null,{"$f":"(SUMPRODUCT(L142:L144,Berechnungsgrundlagen!$B$55:$B$57))*(Berechnungsgrundlagen!$B$53)","v":0},null,{"$f":"(SUMPRODUCT(N142:N144,Berechnungsgrundlagen!$B$55:$B$57))*(Berechnungsgrundlagen!$B$53)","v":0},null,{"$f":"(SUMPRODUCT(P142:P144,Berechnungsgrundlagen!$B$55:$B$57))*(Berechnungsgrundlagen!$B$53)","v":0}]
[]
["VER- UND ENTSORGUNGSINFRASTRUKTUR"]
["Reparaturkosten",null,null,"Anfälligkeitsgrad\neigene Schätzung",null,"Anfälligkeitsgrad\neigene Schätzung",null,"Anfälligkeitsgrad\neigene Schätzung",null,"Anfälligkeitsgrad\neigene Schätzung",null,"Anfälligkeitsgrad\neigene Schätzung",null,"Anfälligkeitsgrad\neigene Schätzung",null,"Anfälligkeitsgrad\neigene Schätzung"]
["Anfälligkeitsgrad, 0 = keine Anfälligkeit, 1 = max. Anfälligkeit:"]
[null,null,null,"Länge in lfm","Kosten in €","Länge in lfm","Kosten in €","Länge in lfm","Kosten in €","Länge in lfm","Kosten in €","Länge in lfm","Kosten in €","Länge in lfm","Kosten in €","Länge in lfm","Kosten in €"]
["Freileitungen",null,null,null,{"$f":"INDEX(Berechnungsgrundlagen!$C$60:$C$64,MATCH($B$151,Freileitungen,0))*$D$149*D151","v":0},null,{"$f":"INDEX(Berechnungsgrundlagen!$C$60:$C$64,MATCH($B$151,Freileitungen,0))*$F$149*F151","v":0},null,{"$f":"INDEX(Berechnungsgrundlagen!$C$60:$C$64,MATCH($B$151,Freileitungen,0))*$H$149*H151","v":0},null,{"$f":"INDEX(Berechnungsgrundlagen!$C$60:$C$64,MATCH($B$151,Freileitungen,0))*$J$149*J151","v":0},null,{"$f":"INDEX(Berechnungsgrundlagen!$C$60:$C$64,MATCH($B$151,Freileitungen,0))*$L$149*L151","v":0},null,{"$f":"INDEX(Berechnungsgrundlagen!$C$60:$C$64,MATCH($B$151,Freileitungen,0))*$N$149*N151","v":0},null,{"$f":"INDEX(Berechnungsgrundlagen!$C$60:$C$64,MATCH($B$151,Freileitungen,0))*$P$149*P151","v":0}]
["Freileitungen",null,null,null,{"$f":"INDEX(Berechnungsgrundlagen!$C$60:$C$64,MATCH($B$152,Freileitungen,0))*$D$149*D152","v":0},null,{"$f":"INDEX(Berechnungsgrundlagen!$C$60:$C$64,MATCH($B$152,Freileitungen,0))*$F$149*F152","v":0},null,{"$f":"INDEX(Berechnungsgrundlagen!$C$60:$C$64,MATCH($B$152,Freileitungen,0))*$H$149*H152","v":0},null,{"$f":"INDEX(Berechnungsgrundlagen!$C$60:$C$64,MATCH($B$152,Freileitungen,0))*$J$149*J152","v":0},null,{"$f":"INDEX(Berechnungsgrundlagen!$C$60:$C$64,MATCH($B$152,Freileitungen,0))*$L$149*L152","v":0},null,{"$f":"INDEX(Berechnungsgrundlagen!$C$60:$C$64,MATCH($B$152,Freileitungen,0))*$N$149*N152","v":0},null,{"$f":"INDEX(Berechnungsgrundlagen!$C$60:$C$64,MATCH($B$152,Freileitungen,0))*$P$149*P152","v":0}]
["Freileitungen",null,null,null,{"$f":"INDEX(Berechnungsgrundlagen!$C$60:$C$64,MATCH($B$153,Freileitungen,0))*$D$149*D153","v":0},null,{"$f":"INDEX(Berechnungsgrundlagen!$C$60:$C$64,MATCH($B$153,Freileitungen,0))*$F$149*F153","v":0},null,{"$f":"INDEX(Berechnungsgrundlagen!$C$60:$C$64,MATCH($B$153,Freileitungen,0))*$H$149*H153","v":0},null,{"$f":"INDEX(Berechnungsgrundlagen!$C$60:$C$64,MATCH($B$153,Freileitungen,0))*$J$149*J153","v":0},null,{"$f":"INDEX(Berechnungsgrundlagen!$C$60:$C$64,MATCH($B$153,Freileitungen,0))*$L$149*L153","v":0},null,{"$f":"INDEX(Berechnungsgrundlagen!$C$60:$C$64,MATCH($B$153,Freileitungen,0))*$N$149*N153","v":0},null,{"$f":"INDEX(Berechnungsgrundlagen!$C$60:$C$64,MATCH($B$153,Freileitungen,0))*$P$149*P153","v":0}]
[]
[null,null,null,"Kosten in €",null,"Kosten in €",null,"Kosten in €",null,"Kosten in €",null,"Kosten in €",null,"Kosten in €",null,"Kosten in €"]
["Stromversorgung unter Gelände"]
["Gasversorgung unter Gelände"]
["Telefonleitungen unter Gelände"]
["Rundfunkleitungen, Glasfaser unter Gelände"]
["Abwasserentsorgung, Kanäle"]
["Wasserversorgung unter Gelände"]
["Sonstige (Leitungen, Masten)"]
["Summe Schadensanfälligkeit Leitungen",null,null,{"$f":"SUM(E151:E153,D156:D162)","v":0},null,{"$f":"SUM(G151:G153,F156:F162)","v":0},null,{"$f":"SUM(I151:I153,H156:H162)","v":0},null,{"$f":"SUM(K151:K153,J156:J162)","v":0},null,{"$f":"SUM(M151:M153,L156:L162)","v":0},null,{"$f":"SUM(O151:O153,N156:N162)","v":0},null,{"$f":"SUM(Q151:Q153,P156:P162)","v":0}]
[]
["Erläuterungen zur Kalkulation der Reparaturkosten der Ver- und Entsorgungsinfrastruktur"]
[]
[]
["SOFORTMASSNAHMEN",null,null,"Kosten in €",null,"Kosten in €",null,"Kosten in €",null,"Kosten in €",null,"Kosten in €",null,"Kosten in €",null,"Kosten in €"]
["Einrichtung und Betrieb einer Notversorgung"]
["Kosten für Leitungsprovisorium (10 % der Reparaturkosten)",null,null,{"$f":"D163*0.1","v":0},null,{"$f":"F163*0.1","v":0},null,{"$f":"H163*0.1","v":0},null,{"$f":"J163*0.1","v":0},null,{"$f":"L163*0.1","v":0},null,{"$f":"N163*0.1","v":0},null,{"$f":"P163*0.1","v":0}]
["Sonstige Kosten (Schadenserhebung, Freimachung etc.)"]
[null,"Kosten in €/lfm\nRichtwert","Kosten in €/lfm\neigene Erhebung","lfm",null,"lfm",null,"lfm",null,"lfm",null,"lfm",null,"lfm",null,"lfm"]
["Räumung/Spülung Kanal",{"$f":"Berechnungsgrundlagen!B73","v":2.3162970106075216},null,null,{"$f":"IF($C$173>0,$C$173,$B$173)*D173","v":0},null,{"$f":"IF($C$173>0,$C$173,$B$173)*F173","v":0},null,{"$f":"IF($C$173>0,$C$173,$B$173)*H173","v":0},null,{"$f":"IF($C$173>0,$C$173,$B$173)*J173","v":0},null,{"$f":"IF($C$173>0,$C$173,$B$173)*L173","v":0},null,{"$f":"IF($C$173>0,$C$173,$B$173)*N173","v":0},null,{"$f":"IF($C$173>0,$C$173,$B$173)*P173","v":0}]
["Summe Sofortmaßnahmen",null,null,null,{"$f":"SUM(D169:D171,E173)","v":0},null,{"$f":"SUM(F169:F171,G173)","v":0},null,{"$f":"SUM(H169:H171,I173)","v":0},null,{"$f":"SUM(J169:J171,K173)","v":0},null,{"$f":"SUM(L169:L171,M173)","v":0},null,{"$f":"SUM(N169:N171,O173)","v":0},null,{"$f":"SUM(P169:P171,Q173)","v":0}]
[]
["Erläuterungen zur Kalkulation der Kosten für Sofortmaßnahmen (Notversorgung, Sonstige Kosten)"]
[]
[]
[]
["SUMMEN SCHADENSANFÄLLIGKEIT"]
["BEI VERKEHRS-,",null,null,"HQ",null,"HQ",null,"HQ",null,"HQ",null,"HQ",null,"HQ",null,"HQ"]
["VER- UND ENTSORGUNGSINFRASTRUKTUR",null,null,{"$f":"Projektgrunddaten!$C$24","v":0},null,{"$f":"Projektgrunddaten!$C$25","v":0},null,{"$f":"Projektgrunddaten!$C$26","v":0},null,{"$f":"Projektgrunddaten!$C$27","v":0},null,{"$f":"Projektgrunddaten!$C$28","v":0},null,{"$f":"Projektgrunddaten!$C$29","v":100},null,{"$f":"Projektgrunddaten!$C$30","v":0}]
[null,null,null,{"$f":"SUM(E174+D163+D145+E135+D123+D97+D65)","v":0},null,{"$f":"SUM(G174+F163+F145+G135+F123+F97+F65)","v":0},null,{"$f":"SUM(I174+H163+H145+I135+H123+H97+H65)","v":0},null,{"$f":"SUM(K174+J163+J145+K135+J123+J97+J65)","v":0},null,{"$f":"SUM(M174+L163+L145+M135+L123+L97+L65)","v":0},null,{"$f":"SUM(O174+N163+N145+O135+N123+N97+N65)","v":0},null,{"$f":"SUM(Q174+P163+P145+Q135+P123+P97+P65)","v":0}]

{"sheet":"Wasserbauliche Anlagen","index":12,"n_rows":28,"n_cols":9,"rows_kept":28,"cut":false,"hidden":false,"merged":[[23,2,23,8],[27,0,27,8],[28,0,28,8],[0,0,0,8],[2,2,2,8],[10,0,10,1],[12,0,12,8],[13,0,13,8],[16,2,16,8]]}
["WASSERBAULICHE ANLAGEN UND GEWÄSSER"]
[]
["Wiederinstandsetzungskosten",null,"bei HQ"]
[null,null,{"$f":"Projektgrunddaten!$C$24","v":0},{"$f":"Projektgrunddaten!$C$25","v":0},{"$f":"Projektgrunddaten!$C$26","v":0},{"$f":"Projektgrunddaten!$C$27","v":0},{"$f":"Projektgrunddaten!$C$28","v":0},{"$f":"Projektgrunddaten!$C$29","v":100},{"$f":"Projektgrunddaten!$C$30","v":0}]
[null,null,"geschätzte Kosten","geschätzte Kosten","geschätzte Kosten","geschätzte Kosten","geschätzte Kosten","geschätzte Kosten","geschätzte Kosten"]
["Uferverbauten"]
["Sohlstufen"]
["Leitwerke"]
["Buhnen"]
["Sonstige wasserbauliche Anlagen"]
["Summe Wiederinstandsetzungskosten \nWasserbau",null,{"$f":"SUM(C6:C10)","v":0},0,0,0,0,0,0]
[]
["Erläuterungen zur Festlegung von Wiederinstandsetzungskosten"]
[]
[]
["Räumungskosten"]
["z.B. bei Verklausungen, Auflandungen",null,"bei HQ"]
[null,null,{"$f":"Projektgrunddaten!$C$24","v":0},{"$f":"Projektgrunddaten!$C$25","v":0},{"$f":"Projektgrunddaten!$C$26","v":0},{"$f":"Projektgrunddaten!$C$27","v":0},{"$f":"Projektgrunddaten!$C$28","v":0},{"$f":"Projektgrunddaten!$C$29","v":100},{"$f":"Projektgrunddaten!$C$30","v":0}]
[null,"Kosten in € pro m³","Kubatur","Kubatur","Kubatur","Kubatur","Kubatur","Kubatur","Kubatur"]
["Räumungskosten (in m³)"]
[]
[]
["SUMMEN SCHADENSANFÄLLIGKEITEN BEI WASSERBAULICHEN ANLAGEN"]
[null,null,"bei HQx"]
[null,null,{"$f":"Projektgrunddaten!$C$24","v":0},{"$f":"Projektgrunddaten!$C$25","v":0},{"$f":"Projektgrunddaten!$C$26","v":0},{"$f":"Projektgrunddaten!$C$27","v":0},{"$f":"Projektgrunddaten!$C$28","v":0},{"$f":"Projektgrunddaten!$C$29","v":100},{"$f":"Projektgrunddaten!$C$30","v":0}]
[null,null,{"$f":"SUM(C11+(B20*C20))","v":0},{"$f":"SUM(D11+(B20*D20))","v":0},{"$f":"SUM(E11+(B20*E20))","v":0},{"$f":"SUM(F11+(B20*F20))","v":0},{"$f":"SUM(G11+(B20*G20))","v":0},{"$f":"SUM(H11+(B20*H20))","v":0},{"$f":"SUM(I11+(B20*I20))","v":0}]
[]
["Erläuterungen zu den Räumungskosten"]

{"sheet":"Land-, Forstwirtschaft","index":13,"n_rows":28,"n_cols":9,"rows_kept":28,"cut":false,"hidden":false,"merged":[[22,0,22,8],[25,2,25,8],[0,0,0,8],[2,2,2,8],[15,2,15,8],[21,0,21,8]]}
["LAND- UND FORSTWIRTSCHAFTLICHE FLÄCHEN"]
[]
["ERTRAGSVERLUSTE",null,"bei HQ"]
[null,null,{"$f":"Projektgrunddaten!$C$24","v":0},{"$f":"Projektgrunddaten!$C$25","v":0},{"$f":"Projektgrunddaten!$C$26","v":0},{"$f":"Projektgrunddaten!$C$27","v":0},{"$f":"Projektgrunddaten!$C$28","v":0},{"$f":"Projektgrunddaten!$C$29","v":100},{"$f":"Projektgrunddaten!$C$30","v":0}]
["Landwirtschaftliche Nutzung"]
["Prozentualer Anteil Sommerhochwässer \n(100% = ausschließlich Sommerhochwässer)"]
[null,"Ertragsverlust \nin €/ha ","Fläche in ha","Fläche in ha","Fläche in ha","Fläche in ha","Fläche in ha","Fläche in ha","Fläche in ha"]
["Grünland",{"$f":"Berechnungsgrundlagen!B79/2","v":1420.6312825458051},{"$f":"(Flächennutzungen!D38)/10000","v":0},{"$f":"(Flächennutzungen!F38)/10000","v":0},{"$f":"(Flächennutzungen!H38)/10000","v":0},{"$f":"(Flächennutzungen!J38)/10000","v":0},{"$f":"(Flächennutzungen!L38)/10000","v":0},{"$f":"(Flächennutzungen!N38)/10000","v":0},{"$f":"(Flächennutzungen!P38)/10000","v":0}]
["Ackerland",{"$f":"Berechnungsgrundlagen!B80/2","v":1894.1808341369335},{"$f":"(Flächennutzungen!D39)/10000","v":0},{"$f":"(Flächennutzungen!F39)/10000","v":0},{"$f":"(Flächennutzungen!H39)/10000","v":0},{"$f":"(Flächennutzungen!J39)/10000","v":0},{"$f":"(Flächennutzungen!L39)/10000","v":0},{"$f":"(Flächennutzungen!N39)/10000","v":0},{"$f":"(Flächennutzungen!P39)/10000","v":0}]
["Sonderkulturen",null,{"$f":"(Flächennutzungen!D40)/10000","v":0},{"$f":"(Flächennutzungen!F40)/10000","v":0},{"$f":"(Flächennutzungen!H40)/10000","v":0},{"$f":"(Flächennutzungen!J40)/10000","v":0},{"$f":"(Flächennutzungen!L40)/10000","v":0},{"$f":"(Flächennutzungen!N40)/10000","v":0},{"$f":"(Flächennutzungen!P40)/10000","v":0}]
["Sonstige Nutzflächen",null,{"$f":"(Flächennutzungen!D41)/10000","v":0},{"$f":"(Flächennutzungen!F41)/10000","v":0},{"$f":"(Flächennutzungen!H41)/10000","v":0},{"$f":"(Flächennutzungen!J41)/10000","v":0},{"$f":"(Flächennutzungen!L41)/10000","v":0},{"$f":"(Flächennutzungen!N41)/10000","v":0},{"$f":"(Flächennutzungen!P41)/10000","v":0}]
["Forstwirtschaftliche Nutzung ",null,{"$f":"(Flächennutzungen!D42)/10000","v":0},{"$f":"(Flächennutzungen!F42)/10000","v":0},{"$f":"(Flächennutzungen!H42)/10000","v":0},{"$f":"(Flächennutzungen!J42)/10000","v":0},{"$f":"(Flächennutzungen!L42)/10000","v":0},{"$f":"(Flächennutzungen!N42)/10000","v":0},{"$f":"(Flächennutzungen!P42)/10000","v":0}]
["Summe land- und forstwirtschaftliche Nutzung",null,{"$f":"SUM($B$8*C8*IF($B$6=\"\",1,$B$6))+(C9*$B$9)+($B$10*C10)+($B$11*C11)+($B$12*C12)","v":0},0,0,0,0,0,0]
[]
["RÄUMUNGS- UND REKULTIVIERUNGSMAßNAHMEN"]
[null,null,"bei HQ"]
[null,null,{"$f":"Projektgrunddaten!$C$24","v":0},{"$f":"Projektgrunddaten!$C$25","v":0},{"$f":"Projektgrunddaten!$C$26","v":0},{"$f":"Projektgrunddaten!$C$27","v":0},{"$f":"Projektgrunddaten!$C$28","v":0},{"$f":"Projektgrunddaten!$C$29","v":100},{"$f":"Projektgrunddaten!$C$30","v":0}]
[null,"Kosten in € pro Einheit","Kubatur bzw. Fläche","Kubatur bzw. Fläche","Kubatur bzw. Fläche","Kubatur bzw. Fläche","Kubatur bzw. Fläche","Kubatur bzw. Fläche","Kubatur bzw. Fläche"]
["Räumungskosten (in m³)"]
["Rekultivierungskosten (in ha)"]
[]
["Begründung für Aufnahme in die Bewertung (siehe Erläuterungen)"]
[]
[]
["Summen Schadensanfälligkeit bei land- und forstwirtschaftlichen Flächen"]
[null,null,"bei HQ"]
[null,null,{"$f":"Projektgrunddaten!$C$24","v":0},{"$f":"Projektgrunddaten!$C$25","v":0},{"$f":"Projektgrunddaten!$C$26","v":0},{"$f":"Projektgrunddaten!$C$27","v":0},{"$f":"Projektgrunddaten!$C$28","v":0},{"$f":"Projektgrunddaten!$C$29","v":100},{"$f":"Projektgrunddaten!$C$30","v":0}]
[null,null,{"$f":"C13+SUMPRODUCT($B$19:$B$20,C19:C20)","v":0},0,0,0,0,0,0]

{"sheet":"Sonstige Flächennutzungen","index":14,"n_rows":21,"n_cols":11,"rows_kept":21,"cut":false,"hidden":false,"merged":[[22,0,22,10],[0,0,0,10],[2,4,2,10],[4,1,4,3],[16,4,16,10],[20,0,20,10],[21,0,21,10]]}
["SONSTIGE FLÄCHENNUTZUNGEN"]
[]
[null,null,null,"bei HQx","bei HQ"]
[null,null,null,null,{"$f":"Projektgrunddaten!$C$24","v":0},{"$f":"Projektgrunddaten!$C$25","v":0},{"$f":"Projektgrunddaten!$C$26","v":0},{"$f":"Projektgrunddaten!$C$27","v":0},{"$f":"Projektgrunddaten!$C$28","v":0},{"$f":"Projektgrunddaten!$C$29","v":100},{"$f":"Projektgrunddaten!$C$30","v":0}]
[null,"Wiederherstellungskosten in €/m²"]
[null,"\nRichtwerte","Eigene Werte","Rechenwert","m²","m²","m²","m²","m²","m²","m²"]
["Grünflächen",{"$f":"Berechnungsgrundlagen!B86","v":1.1581485053037608},null,{"$f":"IF(B7+C7=B7,B7,C7)","v":1.1581485053037608},{"$f":"Flächennutzungen!D47","v":0},{"$f":"Flächennutzungen!F47","v":0},{"$f":"Flächennutzungen!H47","v":0},{"$f":"Flächennutzungen!J47","v":0},{"$f":"Flächennutzungen!L47","v":0},{"$f":"Flächennutzungen!N47","v":0},{"$f":"Flächennutzungen!P47","v":0}]
["Sport- und Freizeitflächen, Kinderspielplätze",{"$f":"Berechnungsgrundlagen!B87","v":2.3162970106075216},null,2.3162970106075216,{"$f":"Flächennutzungen!D48","v":0},{"$f":"Flächennutzungen!F48","v":0},{"$f":"Flächennutzungen!H48","v":0},{"$f":"Flächennutzungen!J48","v":0},{"$f":"Flächennutzungen!L48","v":0},{"$f":"Flächennutzungen!N48","v":0},{"$f":"Flächennutzungen!P48","v":0}]
["Campingplätze",{"$f":"Berechnungsgrundlagen!B88","v":2.3162970106075216},null,2.3162970106075216,{"$f":"Flächennutzungen!D49","v":0},{"$f":"Flächennutzungen!F49","v":0},{"$f":"Flächennutzungen!H49","v":0},{"$f":"Flächennutzungen!J49","v":0},{"$f":"Flächennutzungen!L49","v":0},{"$f":"Flächennutzungen!N49","v":0},{"$f":"Flächennutzungen!P49","v":0}]
["Parkanlagen",{"$f":"Berechnungsgrundlagen!B89","v":2.3162970106075216},null,2.3162970106075216,{"$f":"Flächennutzungen!D50","v":0},{"$f":"Flächennutzungen!F50","v":0},{"$f":"Flächennutzungen!H50","v":0},{"$f":"Flächennutzungen!J50","v":0},{"$f":"Flächennutzungen!L50","v":0},{"$f":"Flächennutzungen!N50","v":0},{"$f":"Flächennutzungen!P50","v":0}]
["Friedhöfe",{"$f":"Berechnungsgrundlagen!B90","v":2.3162970106075216},null,2.3162970106075216,{"$f":"Flächennutzungen!D51","v":0},{"$f":"Flächennutzungen!F51","v":0},{"$f":"Flächennutzungen!H51","v":0},{"$f":"Flächennutzungen!J51","v":0},{"$f":"Flächennutzungen!L51","v":0},{"$f":"Flächennutzungen!N51","v":0},{"$f":"Flächennutzungen!P51","v":0}]
["Kleingartensiedlungen",{"$f":"Berechnungsgrundlagen!B91","v":3.4744455159112824},null,3.4744455159112824,{"$f":"Flächennutzungen!D52","v":0},{"$f":"Flächennutzungen!F52","v":0},{"$f":"Flächennutzungen!H52","v":0},{"$f":"Flächennutzungen!J52","v":0},{"$f":"Flächennutzungen!L52","v":0},{"$f":"Flächennutzungen!N52","v":0},{"$f":"Flächennutzungen!P52","v":0}]
[{"$f":"Flächennutzungen!B53","v":"Sonstige Flächennutzungen 1"},null,null,{"$f":"C13","v":0},{"$f":"Flächennutzungen!D53","v":0},{"$f":"Flächennutzungen!F53","v":0},{"$f":"Flächennutzungen!H53","v":0},{"$f":"Flächennutzungen!J53","v":0},{"$f":"Flächennutzungen!L53","v":0},{"$f":"Flächennutzungen!N53","v":0},{"$f":"Flächennutzungen!P53","v":0}]
[{"$f":"Flächennutzungen!B54","v":"Sonstige Flächennutzungen 2"},null,null,{"$f":"C14","v":0},{"$f":"Flächennutzungen!D54","v":0},{"$f":"Flächennutzungen!F54","v":0},{"$f":"Flächennutzungen!H54","v":0},{"$f":"Flächennutzungen!J54","v":0},{"$f":"Flächennutzungen!L54","v":0},{"$f":"Flächennutzungen!N54","v":0},{"$f":"Flächennutzungen!P54","v":0}]
[]
["Summe Schadensanfälligkeit bei sonstigen Nutzungen"]
[null,null,null,null,"bei HQ"]
[null,null,null,"bei HQx",{"$f":"Projektgrunddaten!$C$24","v":0},{"$f":"Projektgrunddaten!$C$25","v":0},{"$f":"Projektgrunddaten!$C$26","v":0},{"$f":"Projektgrunddaten!$C$27","v":0},{"$f":"Projektgrunddaten!$C$28","v":0},{"$f":"Projektgrunddaten!$C$29","v":100},{"$f":"Projektgrunddaten!$C$30","v":0}]
[null,null,null,null,{"$f":"SUMPRODUCT($D$7:$D$14,E7:E14)","v":0},0,0,0,0,0,0]
[]
["Begründung für die Änderung der Richtwerte für Wiederherstellkosten und für die Flächenschätzungen"]

{"sheet":"Fremdenverkehr","index":15,"n_rows":18,"n_cols":10,"rows_kept":18,"cut":false,"hidden":false,"merged":[[0,0,0,9],[9,3,9,9],[15,3,15,9]]}
["FREMDENVERKEHR"]
[]
[]
["Ermittlung der Auslastungszahlen"]
[]
[null,"Anzahl Betten gesamt","Auslastung \npro Tag (in %)","Anzahl Übernachtungen pro Tag"]
["Beherbergungsbetriebe",null,null,{"$f":"B7*C7","v":0}]
[]
[]
[null,null,null,"Mittlere Ausfalltage bei HQ"]
[null,null,"Tagesausgaben in\n€/Person",{"$f":"Projektgrunddaten!$C$24","v":0},{"$f":"Projektgrunddaten!$C$25","v":0},{"$f":"Projektgrunddaten!$C$26","v":0},{"$f":"Projektgrunddaten!$C$27","v":0},{"$f":"Projektgrunddaten!$C$28","v":0},{"$f":"Projektgrunddaten!$C$29","v":100},{"$f":"Projektgrunddaten!$C$30","v":0}]
["Beherbergungsbetriebe",null,{"$f":"IF(ISNUMBER(VLOOKUP(Projektgrunddaten!C7,Berechnungsgrundlagen!D99:E107,2)),(VLOOKUP(Projektgrunddaten!C7,Berechnungsgrundlagen!D99:E107,2)),0)","v":41.693346190935387},{"$f":"IF(Wertschöpfungsverluste!C13<>0,Wertschöpfungsverluste!E13/Wertschöpfungsverluste!C13,0)","v":0},{"$f":"IF(Wertschöpfungsverluste!$C$13<>0,Wertschöpfungsverluste!$G$13/Wertschöpfungsverluste!$C$13,0)","v":0},{"$f":"IF(Wertschöpfungsverluste!$C$13<>0,Wertschöpfungsverluste!$I$13/Wertschöpfungsverluste!$C$13,0)","v":0},{"$f":"IF(Wertschöpfungsverluste!$C$13<>0,Wertschöpfungsverluste!$K$13/Wertschöpfungsverluste!$C$13,0)","v":0},{"$f":"IF(Wertschöpfungsverluste!$C$13<>0,Wertschöpfungsverluste!$M$13/Wertschöpfungsverluste!$C$13,0)","v":0},{"$f":"IF(Wertschöpfungsverluste!$C$13<>0,Wertschöpfungsverluste!$O$13/Wertschöpfungsverluste!$C$13,0)","v":0},{"$f":"IF(Wertschöpfungsverluste!$C$13<>0,Wertschöpfungsverluste!$Q$13/Wertschöpfungsverluste!$C$13,0)","v":0}]
[]
[]
["Summe Zusätzliche Wertschöpfungsverluste Fremdenverkehr"]
[null,null,null,"bei HQ"]
[null,null,null,{"$f":"Projektgrunddaten!$C$24","v":0},{"$f":"Projektgrunddaten!$C$25","v":0},{"$f":"Projektgrunddaten!$C$26","v":0},{"$f":"Projektgrunddaten!$C$27","v":0},{"$f":"Projektgrunddaten!$C$28","v":0},{"$f":"Projektgrunddaten!$C$29","v":100},{"$f":"Projektgrunddaten!$C$30","v":0}]
[null,null,null,{"$f":"D12*(C12*0.4)*D7","v":0},{"$f":"E12*(C12*0.4)*D7","v":0},{"$f":"F12*(C12*0.4)*D7","v":0},{"$f":"G12*(C12*0.4)*D7","v":0},{"$f":"H12*(C12*0.4)*D7","v":0},{"$f":"I12*(C12*0.4)*D7","v":0},{"$f":"J12*(C12*0.4)*D7","v":0}]

{"sheet":"Summe monetär bewertete Schäden","index":16,"n_rows":20,"n_cols":11,"rows_kept":20,"cut":false,"hidden":false,"merged":[[20,0,20,10],[21,0,21,10],[14,0,14,3],[15,0,15,3],[16,0,16,10],[17,0,17,3],[18,0,18,10],[19,0,19,10],[13,0,13,3],[0,0,0,10],[1,0,1,10],[2,4,2,10],[5,0,5,3],[6,0,6,3],[7,0,7,3],[8,0,8,3],[9,0,9,3],[10,0,10,3],[11,0,11,3],[12,0,12,3]]}
["SUMME DER MONETÄR BEWERTETEN SCHÄDEN"]
[]
[null,null,null,null,"bei HQ"]
[null,null,null,null,{"$f":"Projektgrunddaten!$C$24","v":0},{"$f":"Projektgrunddaten!$C$25","v":0},{"$f":"Projektgrunddaten!$C$26","v":0},{"$f":"Projektgrunddaten!$C$27","v":0},{"$f":"Projektgrunddaten!$C$28","v":0},{"$f":"Projektgrunddaten!$C$29","v":100},{"$f":"Projektgrunddaten!$C$30","v":0}]
[null,null,null,null,"in €","in €","in €","in €","in €","in €","in €"]
["Wohngebäude ",null,null,null,{"$f":"'Schadensermittlung Wohngebäude'!C12","v":0},{"$f":"'Schadensermittlung Wohngebäude'!S12","v":0},{"$f":"'Schadensermittlung Wohngebäude'!AI12","v":0},{"$f":"'Schadensermittlung Wohngebäude'!AY12","v":0},{"$f":"'Schadensermittlung Wohngebäude'!BO12","v":0},{"$f":"'Schadensermittlung Wohngebäude'!CE12","v":0},{"$f":"'Schadensermittlung Wohngebäude'!CU12","v":0}]
["Nicht-Wohngebäude + Öffentliche Gebäude",null,null,null,{"$f":"'Schadensermittl.  NichtWGebäude'!C12+'Schadenseingabe Öffentl. Geb.'!D13","v":0},{"$f":"'Schadensermittl.  NichtWGebäude'!S12+'Schadenseingabe Öffentl. Geb.'!F13","v":0},{"$f":"'Schadensermittl.  NichtWGebäude'!AI12+'Schadenseingabe Öffentl. Geb.'!H13","v":0},{"$f":"'Schadensermittl.  NichtWGebäude'!AY12+'Schadenseingabe Öffentl. Geb.'!J13","v":0},{"$f":"'Schadensermittl.  NichtWGebäude'!BO12+'Schadenseingabe Öffentl. Geb.'!L13","v":0},{"$f":"'Schadensermittl.  NichtWGebäude'!CE12+'Schadenseingabe Öffentl. Geb.'!N13","v":0},{"$f":"'Schadensermittl.  NichtWGebäude'!CU12+'Schadenseingabe Öffentl. Geb.'!P13","v":0}]
["Verkehrs-, Ver- sowie Entsorgungsinfrastruktur",null,null,null,{"$f":"Infrastruktur!D183","v":0},{"$f":"Infrastruktur!F183","v":0},{"$f":"Infrastruktur!H183","v":0},{"$f":"Infrastruktur!J183","v":0},{"$f":"Infrastruktur!L183","v":0},{"$f":"Infrastruktur!N183","v":0},{"$f":"Infrastruktur!P183","v":0}]
["Wasserbauliche Anlagen und Gewässer",null,null,null,{"$f":"'Wasserbauliche Anlagen'!C26","v":0},{"$f":"'Wasserbauliche Anlagen'!D26","v":0},{"$f":"'Wasserbauliche Anlagen'!E26","v":0},{"$f":"'Wasserbauliche Anlagen'!F26","v":0},{"$f":"'Wasserbauliche Anlagen'!G26","v":0},{"$f":"'Wasserbauliche Anlagen'!H26","v":0},{"$f":"'Wasserbauliche Anlagen'!I26","v":0}]
["Land- und forstwirtschaftliche Flächen",null,null,null,{"$f":"'Land-, Forstwirtschaft'!C28","v":0},{"$f":"'Land-, Forstwirtschaft'!D28","v":0},{"$f":"'Land-, Forstwirtschaft'!E28","v":0},{"$f":"'Land-, Forstwirtschaft'!F28","v":0},{"$f":"'Land-, Forstwirtschaft'!G28","v":0},{"$f":"'Land-, Forstwirtschaft'!H28","v":0},{"$f":"'Land-, Forstwirtschaft'!I28","v":0}]
["Sonstige Flächennutzungen",null,null,null,{"$f":"'Sonstige Flächennutzungen'!E19","v":0},{"$f":"'Sonstige Flächennutzungen'!F19","v":0},{"$f":"'Sonstige Flächennutzungen'!G19","v":0},{"$f":"'Sonstige Flächennutzungen'!H19","v":0},{"$f":"'Sonstige Flächennutzungen'!I19","v":0},{"$f":"'Sonstige Flächennutzungen'!J19","v":0},{"$f":"'Sonstige Flächennutzungen'!K19","v":0}]
["Summe der Vermögensschäden",null,null,null,{"$f":"SUM(E6:E11)","v":0},0,0,0,0,0,0]
["Wertschöpfungsverluste Gewerbe und Industrie",null,null,null,{"$f":"IF(ISNUMBER(Wertschöpfungsverluste!D23),Wertschöpfungsverluste!D23,0)","v":0},{"$f":"IF(ISNUMBER(Wertschöpfungsverluste!F23),Wertschöpfungsverluste!F23,0)","v":0},{"$f":"IF(ISNUMBER(Wertschöpfungsverluste!H23),Wertschöpfungsverluste!H23,0)","v":0},{"$f":"IF(ISNUMBER(Wertschöpfungsverluste!J23),Wertschöpfungsverluste!J23,0)","v":0},{"$f":"IF(ISNUMBER(Wertschöpfungsverluste!L23),Wertschöpfungsverluste!L23,0)","v":0},{"$f":"IF(ISNUMBER(Wertschöpfungsverluste!N23),Wertschöpfungsverluste!N23,0)","v":0},{"$f":"IF(ISNUMBER(Wertschöpfungsverluste!P23),Wertschöpfungsverluste!P23,0)","v":0}]
["Zusätzliche Wertschöpfungsverluste im Fremdenverkehr ",null,null,null,{"$f":"IF(ISNUMBER(Fremdenverkehr!D18),Fremdenverkehr!D18,0)","v":0},{"$f":"IF(ISNUMBER(Fremdenverkehr!E18),Fremdenverkehr!E18,0)","v":0},{"$f":"IF(ISNUMBER(Fremdenverkehr!F18),Fremdenverkehr!F18,0)","v":0},{"$f":"IF(ISNUMBER(Fremdenverkehr!G18),Fremdenverkehr!G18,0)","v":0},{"$f":"IF(ISNUMBER(Fremdenverkehr!H18),Fremdenverkehr!H18,0)","v":0},{"$f":"IF(ISNUMBER(Fremdenverkehr!I18),Fremdenverkehr!I18,0)","v":0},{"$f":"IF(ISNUMBER(Fremdenverkehr!J18),Fremdenverkehr!J18,0)","v":0}]
["Summe der Wertschöpfungsverluste",null,null,null,{"$f":"SUM(E13:E14)","v":0},0,0,0,0,0,0]
["Katastrophenschutz - Aufwand für HW-Einsatz"]
[]
["Summe der monetär bewerteten Schäden",null,null,null,{"$f":"E12+E15+E16","v":0},0,{"$f":"G12+G15+G16","v":0},0,0,0,0]
[]
["Erläuterung der Berechnungsansätze für Katastrophenschäden (Aufwendungen des Katastrophenschutzeinsatzes)"]

{"sheet":"Schadenserwartungen","index":17,"n_rows":21,"n_cols":31,"rows_kept":21,"cut":false,"hidden":false,"merged":[[13,14,13,21],[15,2,15,6],[16,2,16,6],[0,1,0,12],[0,15,0,29],[1,1,2,1],[1,2,1,9],[1,10,1,12],[1,14,2,14],[1,15,1,22],[1,24,1,29]]}
["KNU14","SCHADENSERWARTUNGEN",null,null,null,null,null,null,null,null,null,null,null,null,null,"5.3.2 SCHADENSERWARTUNGEN BEI RETENTIONS- UND KOMBIMAßNAHMEN"]
[null,"Stütz-stelle","Ohne-Fall",null,null,null,null,null,null,null,"Mit-Fall",null,null,null,"Stütz-stelle","Ohne-Fall",null,null,null,null,null,null,null,null,"Mit-Fall"]
[null,null,"HQx\nm³/s","Jährlichkeit Tn\na (Ohne-Fall)","Pi\n1/a","DPi\n1/a","Si\n€","1/2(Si-1 + Si)\n€","DSG\n€/a","Gesamtschadens-erwartung (SG)\n€/a","Si\n€","DSV\n€/a","verbleibende Schadens-erwartung (SV)\n€/a",null,null,"HQx\nm³/s","Jährlichkeit Tn\na (Ohne-Fall)","Pi\n1/a","DPi\n1/a","Si\n€","1/2(Si-1 + Si)\n€","DSG\n€/a","Gesamtschadens-erwartung SG\n€/a","Jährlichkeit Tn\na (Mit-Fall)","Pi\n1/a","DPi\n1/a","Si\n€","1/2(Si-1 + Si)\n€","DSV\n€/a","verbleibende \nSchadenserwartung SV\n€/a"]
[null,null,null,{"$f":"Berechnungsgrundlagen!D11","v":6},null,0,null,null,null,null,0,null,null,null,null,null,null,null,null,null,null,null,null,null,null,null,null,null,null,null,0]
[null,null,{"$f":"Projektgrunddaten!D23","v":0},{"$f":"Projektgrunddaten!C23","v":0},{"$f":"IF(D5=0,0,1/D5)","v":0},null,null,null,null,{"$f":"SUM(I5)","v":0},{"$f":"IF(D5>Berechnungsgrundlagen!$D$12,G5,\"\")","v":""},{"$f":"IF(D5>Berechnungsgrundlagen!$D$11,I5,\"\")","v":""},null,{"$f":"Berechnungsgrundlagen!$D$10","v":7},1,{"$f":"Projektgrunddaten!D23","v":0},{"$f":"Projektgrunddaten!C23","v":0},{"$f":"IF(Q5=0,0,1/Q5)","v":0},null,null,null,null,{"$f":"SUM(V5)","v":0},null,{"$f":"IF(X5=0,0,1/X5)","v":0},null,null,null,null,{"$f":"AC5","v":0},{"$f":"IF(D5>=100,G5,\"\")","v":""}]
[null,{"$f":"Projektgrunddaten!B24","v":1},{"$f":"Projektgrunddaten!D24","v":0},{"$f":"IF(N6=1,Projektgrunddaten!C24,0)","v":0},{"$f":"IF(D6=0,0,1/D6)*N6","v":0},{"$f":"(IF((E5-E6)<0,0,E5-E6))*N6","v":0},{"$f":"IF(N6=1,'Summe monetär bewertete Schäden'!E18,0)","v":0},{"$f":"(0.5*((G5)+G6))*N6","v":0},{"$f":"F6*H6","v":0},{"$f":"SUM($I$5:I6)*N6","v":0},{"$f":"IF(D6>Berechnungsgrundlagen!$D$12,G6,\"\")","v":""},{"$f":"IF(D6>Berechnungsgrundlagen!$D$12,I6,\"\")","v":""},{"$f":"IF(D6>Berechnungsgrundlagen!$D$12,SUM($L$6:L6),\"\")","v":""},{"$f":"IF(Berechnungsgrundlagen!$D$10>=1,1,0)","v":1},2,{"$f":"Projektgrunddaten!D24","v":0},{"$f":"IF(N6=1,Projektgrunddaten!C24,0)","v":0},{"$f":"IF(Q6<=0,0,1/Q6)*N6","v":0},{"$f":"IF(R5-R6<0,0,ROUND(R5-R6,3)*N6)","v":0},{"$f":"IF(N6=1,'Summe monetär bewertete Schäden'!E18,0)","v":0},{"$f":"0.5*((T5)+T6)*N6","v":0},{"$f":"S6*U6","v":0},{"$f":"SUM($V$5:V6)*N6","v":0},null,{"$f":"IF(X6=0,0,1/X6)","v":0},{"$f":"IF((Y5-Y6)<0,0,ROUND(Y5-Y6,3)*N6)","v":0},{"$f":"IF(Z6=0,0,'Summe monetär bewertete Schäden'!E18)","v":0},{"$f":"((AA5+AA6)/2)*N6","v":0},{"$f":"AB6*Z6","v":0},{"$f":"SUM($AC$5:AC6)","v":0},{"$f":"IF(D6>=Berechnungsgrundlagen!$D$11,G6,\"\")","v":""}]
[null,{"$f":"Projektgrunddaten!B25","v":2},{"$f":"Projektgrunddaten!D25","v":0},{"$f":"IF(N7=1,Projektgrunddaten!C25,0)","v":0},{"$f":"IF(D7=0,0,1/D7)*N7","v":0},0,{"$f":"IF(N7=1,'Summe monetär bewertete Schäden'!F18,0)","v":0},0,0,{"$f":"SUM($I$5:I7)*N7","v":0},{"$f":"IF(D7>Berechnungsgrundlagen!$D$12,G7,\"\")","v":""},{"$f":"IF(D7>Berechnungsgrundlagen!$D$12,I7,\"\")","v":""},{"$f":"IF(D7>Berechnungsgrundlagen!$D$12,SUM($L$6:L7),\"\")","v":""},{"$f":"IF(Berechnungsgrundlagen!$D$10>=2,1,0)","v":1},3,{"$f":"Projektgrunddaten!D25","v":0},{"$f":"IF(N7=1,Projektgrunddaten!C25,0)","v":0},{"$f":"IF(Q7<=0,0,1/Q7)*N7","v":0},0,{"$f":"IF(N7=1,'Summe monetär bewertete Schäden'!F18,0)","v":0},0,0,{"$f":"SUM($V$5:V7)*N7","v":0},null,0,0,{"$f":"IF(Z7=0,0,'Summe monetär bewertete Schäden'!F18)","v":0},0,{"$f":"AB7*Z7","v":0},{"$f":"SUM($AC$5:AC7)","v":0}]
[null,{"$f":"Projektgrunddaten!B26","v":3},{"$f":"Projektgrunddaten!D26","v":0},{"$f":"IF(N8=1,Projektgrunddaten!C26,0)","v":0},0,0,{"$f":"IF(N8=1,'Summe monetär bewertete Schäden'!G18,0)","v":0},0,0,{"$f":"SUM($I$5:I8)*N8","v":0},{"$f":"IF(D8>Berechnungsgrundlagen!$D$12,G8,\"\")","v":""},{"$f":"IF(D8>Berechnungsgrundlagen!$D$12,I8,\"\")","v":""},{"$f":"IF(D8>Berechnungsgrundlagen!$D$12,SUM($L$6:L8),\"\")","v":""},{"$f":"IF(Berechnungsgrundlagen!$D$10>=3,1,0)","v":1},4,{"$f":"Projektgrunddaten!D26","v":0},{"$f":"IF(N8=1,Projektgrunddaten!C26,0)","v":0},0,0,{"$f":"IF(N8=1,'Summe monetär bewertete Schäden'!G18,0)","v":0},0,0,{"$f":"SUM($V$5:V8)*N8","v":0},null,0,0,{"$f":"IF(Z8=0,0,'Summe monetär bewertete Schäden'!G18)","v":0},0,0,{"$f":"SUM($AC$5:AC8)","v":0},{"$f":"IF(D8>=Berechnungsgrundlagen!$D$11,G8,\"\")","v":""}]
[null,{"$f":"Projektgrunddaten!B27","v":4},{"$f":"Projektgrunddaten!D27","v":0},{"$f":"IF(N9=1,Projektgrunddaten!C27,0)","v":0},0,0,{"$f":"IF(N9=1,'Summe monetär bewertete Schäden'!H18,0)","v":0},0,0,{"$f":"SUM($I$5:I9)*N9","v":0},{"$f":"IF(D9>Berechnungsgrundlagen!$D$12,G9,\"\")","v":""},{"$f":"IF(D9>Berechnungsgrundlagen!$D$12,I9,\"\")","v":""},{"$f":"IF(D9>Berechnungsgrundlagen!$D$12,SUM($L$6:L9),\"\")","v":""},{"$f":"IF(Berechnungsgrundlagen!$D$10>=4,1,0)","v":1},5,{"$f":"Projektgrunddaten!D27","v":0},{"$f":"IF(N9=1,Projektgrunddaten!C27,0)","v":0},0,0,{"$f":"IF(N9=1,'Summe monetär bewertete Schäden'!H18,)","v":0},0,0,{"$f":"SUM($V$5:V9)*N9","v":0},null,0,0,{"$f":"IF(Z9=0,0,'Summe monetär bewertete Schäden'!H18)","v":0},0,0,{"$f":"SUM($AC$5:AC9)","v":0},{"$f":"IF(D9>=Berechnungsgrundlagen!$D$11,G9,\"\")","v":""}]
[null,{"$f":"Projektgrunddaten!B28","v":5},{"$f":"Projektgrunddaten!D28","v":0},{"$f":"IF(N10=1,Projektgrunddaten!C28,0)","v":0},0,0,{"$f":"IF(N10=1,'Summe monetär bewertete Schäden'!I18,0)","v":0},0,0,{"$f":"SUM($I$5:I10)*N10","v":0},{"$f":"IF(D10>Berechnungsgrundlagen!$D$12,G10,\"\")","v":""},{"$f":"IF(D10>Berechnungsgrundlagen!$D$12,I10,\"\")","v":""},{"$f":"IF(D10>Berechnungsgrundlagen!$D$12,SUM($L$6:L10),\"\")","v":""},{"$f":"IF(Berechnungsgrundlagen!$D$10>=5,1,0)","v":1},6,{"$f":"Projektgrunddaten!D28","v":0},{"$f":"IF(N10=1,Projektgrunddaten!C28,0)","v":0},0,0,{"$f":"IF(N10=1,'Summe monetär bewertete Schäden'!I18,0)","v":0},0,0,{"$f":"SUM($V$5:V10)*N10","v":0},null,0,0,{"$f":"IF(Z10=0,0,'Summe monetär bewertete Schäden'!I18)","v":0},0,0,{"$f":"SUM($AC$5:AC10)","v":0},{"$f":"IF(D10>=Berechnungsgrundlagen!$D$11,G10,\"\")","v":""}]
[null,{"$f":"Projektgrunddaten!B29","v":6},{"$f":"Projektgrunddaten!D29","v":0},{"$f":"IF(N11=1,Projektgrunddaten!C29,0)","v":100},0.01,0,{"$f":"IF(N11=1,'Summe monetär bewertete Schäden'!J18,0)","v":0},0,0,{"$f":"SUM($I$5:I11)*N11","v":0},{"$f":"IF(D11>Berechnungsgrundlagen!$D$12,G11,\"\")","v":""},{"$f":"IF(D11>Berechnungsgrundlagen!$D$12,I11,\"\")","v":""},{"$f":"IF(D11>Berechnungsgrundlagen!$D$12,SUM($L$6:L11),\"\")","v":""},{"$f":"IF(Berechnungsgrundlagen!$D$10>=6,1,0)","v":1},7,{"$f":"Projektgrunddaten!D29","v":0},{"$f":"IF(N11=1,Projektgrunddaten!C29,0)","v":100},0.01,0,{"$f":"IF(N11=1,'Summe monetär bewertete Schäden'!J18,0)","v":0},0,0,{"$f":"SUM($V$5:V11)*N11","v":0},null,0,0,{"$f":"IF(Z11=0,0,'Summe monetär bewertete Schäden'!J18)","v":0},0,0,{"$f":"SUM($AC$5:AC11)","v":0},{"$f":"IF(D11>=Berechnungsgrundlagen!$D$11,G11,\"\")","v":0}]
[null,{"$f":"Projektgrunddaten!B30","v":7},{"$f":"Projektgrunddaten!D30","v":0},{"$f":"IF(N12=1,Projektgrunddaten!C30,0)","v":0},0,0.01,{"$f":"IF(N12=1,'Summe monetär bewertete Schäden'!K18,0)","v":0},0,0,{"$f":"SUM($I$5:I12)*N12","v":0},{"$f":"IF(D12>Berechnungsgrundlagen!$D$12,G12,\"\")","v":""},{"$f":"IF(D12>Berechnungsgrundlagen!$D$12,I12,\"\")","v":""},{"$f":"IF(D12>Berechnungsgrundlagen!$D$12,SUM($L$6:L12),\"\")","v":""},{"$f":"IF(Berechnungsgrundlagen!$D$10>=7,1,0)","v":1},8,{"$f":"Projektgrunddaten!D30","v":0},{"$f":"IF(N12=1,Projektgrunddaten!C30,0)","v":0},0,0.01,{"$f":"IF(N12=1,'Summe monetär bewertete Schäden'!K18,0)","v":0},0,0,{"$f":"SUM($V$5:V12)*N12","v":0},null,0,0,{"$f":"IF(Z12=0,0,'Summe monetär bewertete Schäden'!K18)","v":0},0,0,{"$f":"SUM($AC$5:AC12)","v":0},{"$f":"IF(D12>=Berechnungsgrundlagen!$D$11,G12,\"\")","v":""}]
[null,null,null,"∞",0,{"$f":"OFFSET(E6,N5-1,0)-E13","v":0},{"$f":"OFFSET(G6,N5-1,0)","v":0},{"$f":"+G13","v":0},0,{"$f":"SUM(I5:I13)","v":0},{"$f":"IF(D13>=Berechnungsgrundlagen!$D$12,G13,\"\")","v":0},{"$f":"IF(D13>Berechnungsgrundlagen!$D$12,I13,\"\")","v":0},{"$f":"IF(D13>Berechnungsgrundlagen!$D$12,SUM($L$6:L13),\"\")","v":0},null,9,null,"¥",0,{"$f":"ROUND(OFFSET(R6,N5-1,0)-R13,3)","v":0},{"$f":"OFFSET(T6,N5-1,0)","v":0},{"$f":"+T13","v":0},0,{"$f":"SUM(V5:V13)","v":0},"¥",0,{"$f":"ROUND(OFFSET(Y6,N5-1,0)-Y13,3)","v":0},{"$f":"OFFSET(AA6,N5-1,0)","v":0},{"$f":"+AA13","v":0},0,{"$f":"SUM($AC$5:AC13)","v":0}]
[null,null,"Gesamtschadenserwartung SG",null,null,null,null,null,null,{"$f":"J13","v":0},"Verbleib. SV",null,{"$f":"M13","v":0},null,"Gesamtschadenserwartung SG",null,null,null,null,null,null,null,{"$f":"W13","v":0},null,null,null,null,"Verbleib. SV",null,{"$f":"AD13","v":0},{"$f":"IF(D12>=Berechnungsgrundlagen!$D$11,G12,\"\")","v":""}]
[]
[null,null,"Gesamtschadenserwartung SG (Ohne-Fall)",null,null,null,null,{"$f":"J14","v":0},"€/a",null,null,null,null,null,null,"Gesamtschadenserwartung SG (Ohne-Fall)",null,null,null,null,{"$f":"W14","v":0},"€/a"]
[null,null,"verbleibende Schadenserwartung über BHQ (Mit-Fall)",null,null,null,null,{"$f":"M14","v":0},"€/a","(Restrisiko)",null,null,null,null,null,"verbleibende Schadenserwartung (Mit-Fall)",null,null,null,null,{"$f":"AD14","v":0},"€/a","(Restrisiko)"]
[null,null,"Erwartungswert der Schadensminderung",null,null,null,null,{"$f":"H16-H17","v":0},"€/a",null,null,null,null,null,null,"Erwartungswert der Schadensminderung",null,null,null,null,{"$f":"U16-U17","v":0},"€/a"]
[]
[]
[null,"HINWEIS:",null,"Die zur Information angefügte Grafik stellt nur die Funktion für die Maßnahmen im Ohne-Fall dar!",null,null,null,null,null,null,null,null,null,null,"HINWEIS:",null,"Die zur Information angefügte Grafik stellt derzeit nur die Funktion für die Maßnahmen im Ohne-Fall dar."]

{"sheet":"A1 Kostenermittlung","index":18,"n_rows":40,"n_cols":4,"rows_kept":40,"cut":false,"hidden":false,"merged":[[0,0,0,2],[6,0,6,3],[24,0,24,3],[31,0,31,3]]}
["KOSTENERMITTLUNG",null,null,"A1"]
[]
["Bauzeit (Jahre)"]
["Betriebsbeginn"]
["Untersuchungszeitraum (Jahre)",80]
[]
["HERSTELLUNGSKOSTEN"]
[null,null,"Teilsummen Baukosten","Summe Herstellungskosten"]
["Kosten der Projektierung"]
["Baukosten"]
["davon für"]
["Dämme und Absperrbauwerke"]
["Stahlwasserbau"]
["maschinenbauliche, elektrische  Anlagenteile"]
["ingenieurbiologische Maßnahmen"]
[]
["Grunderwerbskosten "]
["Allfällige Ablösen"]
[]
["Herstellungskosten gesamt",null,null,{"$f":"SUM(D9+D10+D17+D18)","v":0}]
["Herstellungskosten pro Jahr",null,null,{"$f":"IF(ISNUMBER(D20/B3),(D20/B3),0)","v":0}]
[]
["Akkumulationsfaktor für Herstellungskosten (Reihe):",{"$f":"IF(ISNUMBER(VLOOKUP(B3,Faktoren!A2:E101,5,0)),(VLOOKUP(B3,Faktoren!A2:E101,5,0)),0)","v":0}]
["BARWERT DER HERSTELLUNGSKOSTEN",null,null,{"$f":"(B23*D21)-D17*(VLOOKUP(B5,Faktoren!A2:E101,2,0))","v":0}]
["REINVESTITIONSKOSTEN"]
[null,"Nutzungsdauer \nin Jahren"]
["Stahlwasserbau",40,null,{"$f":"C27*(VLOOKUP(B27,Faktoren!A2:E101,2,0))","v":0}]
["maschinenbauliche, elektrische  Anlagenteile",20,null,{"$f":"C28*((VLOOKUP(B28,Faktoren!A3:E102,2,0))+(VLOOKUP(2*B28,Faktoren!A3:E102,2,0))+(VLOOKUP(3*B28,Faktoren!A3:E102,2,0)))","v":0}]
["ingenieurbiologische Maßnahmen",40,null,{"$f":"C29*(VLOOKUP(B29,Faktoren!A4:E103,2,0))","v":0}]
["BARWERT DER REINVESTITIONSKOSTEN",null,null,{"$f":"SUM(D27:D29)","v":0}]
[]
["INSTANDHALTUNGSKOSTEN"]
["Jährliche Instandhaltungskosten für technische Anlagen ohne ingenieurbiologische Maßnahmen",null,null,{"$f":"SUM(C13+C14+C12)*0.005","v":0}]
["Jährliche Instandhaltungskosten ingenieurbiologische Maßnahmen",null,null,{"$f":"C15*0.01","v":0}]
["Summe jährliche Instandhaltungskosten ",null,null,{"$f":"SUM(D33:D34)","v":0}]
[]
["Diskontierungsfaktor Instandhaltungskosten (Reihe):",{"$f":"VLOOKUP(B5,Faktoren!A2:E101,3,0)","v":26.74877566600269}]
["BARWERT DER INSTANDHALTUNGSKOSTEN",null,null,{"$f":"D35*B37","v":0}]
[]
["PROJEKTKOSTENBARWERT",null,null,{"$f":"IF(ISNUMBER(SUM(D24+D30+D38)),(SUM(D24+D30+D38)),0)","v":0}]

{"sheet":"A1 monetäre  ökonom Effizienz","index":19,"n_rows":42,"n_cols":5,"rows_kept":42,"cut":false,"hidden":false,"merged":[[0,0,0,3],[16,1,16,4]]}
["MONETÄR BELEGTE ÖKONOMISCHE EFFIZIENZ",null,null,null,"A1"]
["NUTZENSCHÄTZUNG"]
[]
["Kalkulationsparameter"]
["Untersuchungszeitraum",{"$f":"'A1 Kostenermittlung'!B5","v":80},"Jahre"]
["Zinsatz p.a.",3.5000000000000003E-2,"p.a."]
["Erwartungswert der Schadensminderung",{"$f":"IF(Berechnungsgrundlagen!I6=1,Schadenserwartungen!H18,Schadenserwartungen!U18)","v":0},"p.a."]
["Diskontierungsfaktor Schadensminderung (Reihe)",null,{"$f":"VLOOKUP(B5,Faktoren!A2:E101,3,0)","v":26.74877566600269}]
["Berücksichtigung von Wertsteigerungen ","1% p.a",34.686999999999998]
[null,"2% p.a",46.8508]
[]
["PROJEKTNUTZENBARWERT"]
["ohne Berücksichtigung von Wertsteigerungen",null,null,null,{"$f":"B7*C8","v":0}]
["mit Berücksichtigung 1% Wertsteigerung",null,null,null,{"$f":"B7*C9","v":0}]
["mit Berücksichtigung 2% Wertsteigerung",null,null,null,{"$f":"B7*C10","v":0}]
["KOSTENSCHÄTZUNG"]
["Projektsalternative",{"$f":"IF(Projektgrunddaten!D13=0,\"\",Projektgrunddaten!D13)","v":"Name Alternative 1"}]
[]
["BARWERT DER HERSTELLUNGSKOSTEN",null,null,null,{"$f":"IF(ISNUMBER('A1 Kostenermittlung'!D24),'A1 Kostenermittlung'!D24,0)","v":0}]
["Projektierung",null,{"$f":"'A1 Kostenermittlung'!D9","v":0}]
["Baukosten",null,{"$f":"'A1 Kostenermittlung'!D10","v":0}]
["davon ingenieurbiologische Maßnahmen",null,{"$f":"'A1 Kostenermittlung'!C15","v":0}]
["Grunderwerbskosten incl. allfälliger Ablösen",null,{"$f":"'A1 Kostenermittlung'!D17","v":0}]
[]
[null,null,null,null,{"$f":"'A1 Kostenermittlung'!D30","v":0}]
[{"$f":"'A1 Kostenermittlung'!A30","v":"BARWERT DER REINVESTITIONSKOSTEN"}]
[]
[]
["BARWERT DER INSTANDHALTUNGSKOSTEN",null,null,null,{"$f":"'A1 Kostenermittlung'!D38","v":0}]
[]
[]
["PROJEKTKOSTENBARWERT",null,null,null,{"$f":"SUM(E19:E29)","v":0}]
[]
["KAPITALWERT KW"]
["ohne Berücksichtigung von Wertsteigerungen",null,null,null,{"$f":"E13-E32","v":0}]
["mit Berücksichtigung 1% Wertsteigerung",null,null,null,{"$f":"E14-E32","v":0}]
["mit Berücksichtigung 2% Wertsteigerung",null,null,null,{"$f":"E15-E32","v":0}]
[]
["NUTZEN-KOSTEN-VERHÄLTNIS NKV"]
["ohne Berücksichtigung von Wertsteigerungen",null,null,null,{"$f":"IF(ISNUMBER(ROUND(E13/E32,2)),(ROUND(E13/E32,2)),0)","v":0}]
["mit Berücksichtigung 1% Wertsteigerung",null,null,null,{"$f":"IF(ISNUMBER(ROUND(E14/E32,2)),(ROUND(E14/E32,2)),0)","v":0}]
["mit Berücksichtigung 2% Wertsteigerung",null,null,null,{"$f":"IF(ISNUMBER(ROUND(E15/E32,2)),(ROUND(E15/E32,2)),0)","v":0}]

{"sheet":"A1 Weitere Projektwirkungen","index":20,"n_rows":38,"n_cols":8,"rows_kept":38,"cut":false,"hidden":false,"merged":[[32,0,32,4],[33,0,33,5],[34,0,35,7],[36,0,36,7],[38,0,38,7],[31,0,31,7],[16,2,16,6],[17,0,18,7],[19,0,19,7],[20,0,20,7],[22,0,22,7],[23,0,23,7],[24,0,24,5],[25,0,25,5],[26,0,27,7],[28,0,28,7],[30,0,30,7],[15,2,15,6],[0,0,0,6],[2,0,2,7],[4,0,4,5],[5,0,5,5],[6,0,6,5],[7,0,8,7],[9,0,9,7],[11,0,11,7],[12,0,12,7],[13,2,13,6],[14,2,14,6]]}
["DARSTELLUNG UND BEURTEILUNG DER WEITEREN PROJEKTWIRKUNGEN",null,null,null,null,null,null,"A1"]
[]
["Beurteilung der Personengefährdung"]
[null,null,null,null,null,null,"direkt","indirekt"]
["Anzahl direkt und indirekt betroffener Personen bei HQ100:"]
["physische Betroffenheit (Gefahr für Leib und Leben)"]
["psychische Betroffenheit (Stress, Traumata, subjektives Sicherheitsgefühl)"]
[]
[]
[]
["Projektwirkung:"]
[]
["Monetär nicht bewertete oder nicht bewertbare ökonomische Nutzen "]
["nicht bewertete sind: ",null,"grundsätzlich bewertbare Nutzen, die z.B. wegen geringer Auswirkungen nicht monetär bewertet werden (Gründe sind hier zu beschreiben)"]
["nicht bewertbar sind:",null,"Prosperitätsschäden, Standortsicherung (Auswirkungen eines Hochwassers auf die Wirtschaftskraft einer Region)"]
[null,null,"Gefährdung sicherheitsrelevanter Einrichtungen"]
[null,null,"Nutzungseinschränkungen bei Ver- und Entsorgungsinfrastruktur"]
[]
[]
[]
[]
["Projektwirkung:"]
[]
["Außerökonomische soziokulturelle Effekte"]
["Auswirkungen auf die Lebensqualität und den Erholungswert"]
["Auswirkungen auf Kulturgüter"]
[]
[]
[]
["Projektwirkung:"]
[]
["Ökologische Aspekte"]
["Verbesserung der ökologischen Situation"]
["verbleibende Beeinträchtigung bei nicht vollständigem ökologischen Wertausgleich"]
[]
[]
[]
["Projektwirkung:"]

{"sheet":"A1 Zssfg Teilbilanzen","index":21,"n_rows":33,"n_cols":8,"rows_kept":33,"cut":false,"hidden":false,"merged":[[31,0,31,7],[32,0,32,7],[33,0,33,7],[28,0,28,7],[29,0,29,1],[29,2,29,3],[29,4,29,7],[30,0,30,1],[30,4,30,7],[25,0,25,7],[0,0,0,6],[2,1,2,6],[3,1,3,6],[5,0,5,7],[13,3,13,5],[15,0,15,7],[16,6,16,7],[17,0,17,5],[22,0,22,5],[23,0,23,7],[24,0,24,7]]}
["ZUSAMMENFASSUNG DER TEILBILANZEN EINER ALTERNATIVE",null,null,null,null,null,null,"A1"]
[]
["PROJEKT",{"$f":"IF(Projektgrunddaten!C3=0,\"\",Projektgrunddaten!C3)","v":""}]
["Alternative",{"$f":"IF(Projektgrunddaten!D13=0,\"\",Projektgrunddaten!D13)","v":"Name Alternative 1"}]
[]
["TEILBILANZ 1"]
[]
[{"$f":"'A1 monetäre  ökonom Effizienz'!A12","v":"PROJEKTNUTZENBARWERT"},null,null,null,null,null,null,{"$f":"'A1 monetäre  ökonom Effizienz'!E13","v":0}]
[{"$f":"'A1 monetäre  ökonom Effizienz'!A32","v":"PROJEKTKOSTENBARWERT"},null,null,null,null,null,null,{"$f":"'A1 monetäre  ökonom Effizienz'!E32","v":0}]
[]
[{"$f":"'A1 monetäre  ökonom Effizienz'!A34","v":"KAPITALWERT KW"},null,null,null,null,null,null,{"$f":"'A1 monetäre  ökonom Effizienz'!E35","v":0}]
[{"$f":"'A1 monetäre  ökonom Effizienz'!A39","v":"NUTZEN-KOSTEN-VERHÄLTNIS NKV"},null,null,null,null,null,null,{"$f":"'A1 monetäre  ökonom Effizienz'!E40","v":0}]
[]
["ERGEBNIS TEILBILANZ 1",null,null,"Absolute Wirtschaftlichkeit ",null,null,{"$f":"IF(H12>=1, \"gegeben\", \"nicht gegeben\")","v":"nicht gegeben"}]
[]
["TEILBILANZ 2"]
[null,null,null,null,null,null,"Beurteilung"]
[{"$f":"'A1 Weitere Projektwirkungen'!A3:H3","v":"Beurteilung der Personengefährdung"},null,null,null,null,null,{"$f":"'A1 Weitere Projektwirkungen'!D11","v":0},{"$f":"'A1 Weitere Projektwirkungen'!E11","v":0}]
[{"$f":"'A1 Weitere Projektwirkungen'!A13:H13","v":"Monetär nicht bewertete oder nicht bewertbare ökonomische Nutzen "},null,null,null,null,null,{"$f":"'A1 Weitere Projektwirkungen'!D22","v":0},{"$f":"'A1 Weitere Projektwirkungen'!E22","v":0}]
[{"$f":"'A1 Weitere Projektwirkungen'!A24:H24","v":"Außerökonomische soziokulturelle Effekte"},null,null,null,null,null,{"$f":"'A1 Weitere Projektwirkungen'!D30","v":0},{"$f":"'A1 Weitere Projektwirkungen'!E30","v":0}]
[{"$f":"'A1 Weitere Projektwirkungen'!A32:H32","v":"Ökologische Aspekte"},null,null,null,null,null,{"$f":"'A1 Weitere Projektwirkungen'!D38","v":0},{"$f":"'A1 Weitere Projektwirkungen'!E38","v":0}]
[]
["ERGEBNIS TEILBILANZ 2"]
["Kurze schriftliche Würdigung der Gesamtbewertung von Teilbilanz 2"]
[]
["GESAMTBEURTEILUNG VON TEILBILANZ 1 und 2"]
[]
["Anmerkung:"]
["Bei einheitlich positiver oder negativer Bewertung der Teilbilanzen 1 und 2 wird das Projekt als gesamtgesellschaftlich vorteilhaft oder nicht vorteilhaft beurteilt. Bei unterschiedlicher Bewertung von Teilbilanz 1 oder 2 ist im freien Feld unter \"Abwägung und Würdigung\" das Projekt als vorteilhaft oder nicht vorteilhaft zu beurteilen und eine Begründung für diese Abwägung zu übermitteln."]
["Teilbilanz 1",null,"Teilbilanz 2",null,"Abwägung und Würdigung"]
[{"$f":"IF(H12>=1, \"positiv\", \"negativ\")","v":"negativ"},null,{"$f":"G23","v":0},{"$f":"H23","v":0}]
[]
["BEGRÜNDUNG DER VORTEILHAFTEN / NICHT VORTEILHAFTEN WÜRDIGUNG"]

{"sheet":"A2 Kostenermittlung","index":22,"n_rows":40,"n_cols":4,"rows_kept":40,"cut":false,"hidden":false,"merged":[[0,0,0,2],[6,0,6,3],[24,0,24,3],[31,0,31,3]]}
["KOSTENERMITTLUNG",null,null,"A2"]
[]
["Bauzeit (Jahre)"]
["Betriebsbeginn"]
["Untersuchungszeitraum (Jahre)",80]
[]
["HERSTELLUNGSKOSTEN"]
[null,null,"Teilsummen Baukosten","Summe Herstellungskosten"]
["Kosten der Projektierung"]
["Baukosten"]
["davon für"]
["Dämme und Absperrbauwerke"]
["Stahlwasserbau"]
["maschinenbauliche, elektrische  Anlagenteile"]
["ingenieurbiologische Maßnahmen"]
[]
["Grunderwerbskosten "]
["Allfällige Ablösen"]
[]
["Herstellungskosten gesamt",null,null,{"$f":"SUM(D9+D10+D17+D18)","v":0}]
["Herstellungskosten pro Jahr",null,null,{"$f":"IF(ISNUMBER(D20/B3),(D20/B3),0)","v":0}]
[]
["Akkumulationsfaktor für Herstellungskosten (Reihe):",{"$f":"IF(ISNUMBER(VLOOKUP(B3,Faktoren!A2:E101,5,0)),(VLOOKUP(B3,Faktoren!A2:E101,5,0)),0)","v":0}]
["BARWERT DER HERSTELLUNGSKOSTEN",null,null,{"$f":"(B23*D21)-D17*(VLOOKUP(B5,Faktoren!A2:E101,2,0))","v":0}]
["REINVESTITIONSKOSTEN"]
[null,"Nutzungsdauer \nin Jahren"]
["Stahlwasserbau",40,null,{"$f":"C27*(VLOOKUP(B27,Faktoren!A2:E101,2,0))","v":0}]
["maschinenbauliche, elektrische  Anlagenteile",20,null,{"$f":"C28*((VLOOKUP(B28,Faktoren!A3:E102,2,0))+(VLOOKUP(2*B28,Faktoren!A3:E102,2,0))+(VLOOKUP(3*B28,Faktoren!A3:E102,2,0)))","v":0}]
["ingenieurbiologische Maßnahmen",40,null,{"$f":"C29*(VLOOKUP(B29,Faktoren!A4:E103,2,0))","v":0}]
["BARWERT DER REINVESTITIONSKOSTEN",null,null,{"$f":"SUM(D27:D29)","v":0}]
[]
["INSTANDHALTUNGSKOSTEN"]
["Jährliche Instandhaltungskosten für technische Anlagen ohne ingenieurbiologische Maßnahmen",null,null,{"$f":"SUM(C13+C14+C12)*0.005","v":0}]
["Jährliche Instandhaltungskosten ingenieurbiologische Maßnahmen",null,null,{"$f":"C15*0.01","v":0}]
["Summe jährliche Instandhaltungskosten ",null,null,{"$f":"SUM(D33:D34)","v":0}]
[]
["Diskontierungsfaktor Instandhaltungskosten (Reihe):",{"$f":"VLOOKUP(B5,Faktoren!A2:E101,3,0)","v":26.74877566600269}]
["BARWERT DER INSTANDHALTUNGSKOSTEN",null,null,{"$f":"D35*B37","v":0}]
[]
["PROJEKTKOSTENBARWERT",null,null,{"$f":"IF(ISNUMBER(SUM(D24+D30+D38)),(SUM(D24+D30+D38)),0)","v":0}]

{"sheet":"A2 monetäre  ökonom Effizienz","index":23,"n_rows":42,"n_cols":5,"rows_kept":42,"cut":false,"hidden":false,"merged":[[0,0,0,3],[16,1,16,4]]}
["MONETÄR BELEGTE ÖKONOMISCHE EFFIZIENZ",null,null,null,"A2"]
["NUTZENSCHÄTZUNG"]
[]
["Kalkulationsparameter"]
["Untersuchungszeitraum",{"$f":"'A2 Kostenermittlung'!B5","v":80},"Jahre"]
["Zinsatz p.a.",3.5000000000000003E-2,"p.a."]
["Erwartungswert der Schadensminderung",{"$f":"IF(Berechnungsgrundlagen!I7=1,Schadenserwartungen!H18,Schadenserwartungen!U18)","v":0},"p.a."]
["Diskontierungsfaktor Schadensminderung (Reihe)",null,{"$f":"VLOOKUP(B5,Faktoren!A2:E101,3,0)","v":26.74877566600269}]
["Berücksichtigung von Wertsteigerungen ","1% p.a",34.686999999999998]
[null,"2% p.a",46.8508]
[]
["PROJEKTNUTZENBARWERT"]
["ohne Berücksichtigung von Wertsteigerungen",null,null,null,{"$f":"B7*C8","v":0}]
["mit Berücksichtigung 1% Wertsteigerung",null,null,null,{"$f":"B7*C9","v":0}]
["mit Berücksichtigung 2% Wertsteigerung",null,null,null,{"$f":"B7*C10","v":0}]
["KOSTENSCHÄTZUNG"]
["Projektsalternative",{"$f":"IF(Projektgrunddaten!D15=0,\"\",Projektgrunddaten!D15)","v":"Name Alternative 2"}]
[]
["BARWERT DER HERSTELLUNGSKOSTEN",null,null,null,{"$f":"IF(ISNUMBER('A2 Kostenermittlung'!D24),'A2 Kostenermittlung'!D24,0)","v":0}]
["Projektierung",null,{"$f":"'A2 Kostenermittlung'!D9","v":0}]
["Baukosten",null,{"$f":"'A2 Kostenermittlung'!D10","v":0}]
["davon ingenieurbiologische Maßnahmen",null,{"$f":"'A2 Kostenermittlung'!C15","v":0}]
["Grunderwerbskosten incl. allfälliger Ablösen",null,{"$f":"'A2 Kostenermittlung'!D17","v":0}]
[]
[null,null,null,null,{"$f":"'A2 Kostenermittlung'!D30","v":0}]
[{"$f":"'A2 Kostenermittlung'!A30","v":"BARWERT DER REINVESTITIONSKOSTEN"}]
[]
[]
["BARWERT DER INSTANDHALTUNGSKOSTEN",null,null,null,{"$f":"'A2 Kostenermittlung'!D38","v":0}]
[]
[]
["PROJEKTKOSTENBARWERT",null,null,null,{"$f":"SUM(E19:E29)","v":0}]
[]
["KAPITALWERT KW"]
["ohne Berücksichtigung von Wertsteigerungen",null,null,null,{"$f":"E13-E32","v":0}]
["mit Berücksichtigung 1% Wertsteigerung",null,null,null,{"$f":"E14-E32","v":0}]
["mit Berücksichtigung 2% Wertsteigerung",null,null,null,{"$f":"E15-E32","v":0}]
[]
["NUTZEN-KOSTEN-VERHÄLTNIS NKV"]
["ohne Berücksichtigung von Wertsteigerungen",null,null,null,{"$f":"IF(ISNUMBER(ROUND(E13/E32,2)),(ROUND(E13/E32,2)),0)","v":0}]
["mit Berücksichtigung 1% Wertsteigerung",null,null,null,{"$f":"IF(ISNUMBER(ROUND(E14/E32,2)),(ROUND(E14/E32,2)),0)","v":0}]
["mit Berücksichtigung 2% Wertsteigerung",null,null,null,{"$f":"IF(ISNUMBER(ROUND(E15/E32,2)),(ROUND(E15/E32,2)),0)","v":0}]

{"sheet":"A2 Weitere Projektwirkungen","index":24,"n_rows":38,"n_cols":8,"rows_kept":38,"cut":false,"hidden":false,"merged":[[32,0,32,4],[33,0,33,5],[34,0,35,7],[36,0,36,7],[38,0,38,7],[31,0,31,7],[16,2,16,6],[17,0,18,7],[19,0,19,7],[20,0,20,7],[22,0,22,7],[23,0,23,7],[24,0,24,5],[25,0,25,5],[26,0,27,7],[28,0,28,7],[30,0,30,7],[15,2,15,6],[0,0,0,6],[2,0,2,7],[4,0,4,5],[5,0,5,5],[6,0,6,5],[7,0,8,7],[9,0,9,7],[11,0,11,7],[12,0,12,7],[13,2,13,6],[14,2,14,6]]}
["DARSTELLUNG UND BEURTEILUNG DER WEITEREN PROJEKTWIRKUNGEN",null,null,null,null,null,null,"A2"]
[]
["Beurteilung der Personengefährdung"]
[null,null,null,null,null,null,"direkt","indirekt"]
["Anzahl direkt und indirekt betroffener Personen bei HQ100:"]
["physische Betroffenheit (Gefahr für Leib und Leben)"]
["psychische Betroffenheit (Stress, Traumata, subjektives Sicherheitsgefühl)"]
[]
[]
[]
["Projektwirkung:"]
[]
["Monetär nicht bewertete oder nicht bewertbare ökonomische Nutzen "]
["nicht bewertete sind: ",null,"grundsätzlich bewertbare Nutzen, die z.B. wegen geringer Auswirkungen nicht monetär bewertet werden (Gründe sind hier zu beschreiben)"]
["nicht bewertbar sind:",null,"Prosperitätsschäden, Standortsicherung (Auswirkungen eines Hochwassers auf die Wirtschaftskraft einer Region)"]
[null,null,"Gefährdung sicherheitsrelevanter Einrichtungen"]
[null,null,"Nutzungseinschränkungen bei Ver- und Entsorgungsinfrastruktur"]
[]
[]
[]
[]
["Projektwirkung:"]
[]
["Außerökonomische soziokulturelle Effekte"]
["Auswirkungen auf die Lebensqualität und den Erholungswert"]
["Auswirkungen auf Kulturgüter"]
[]
[]
[]
["Projektwirkung:"]
[]
["Ökologische Aspekte"]
["Verbesserung der ökologischen Situation"]
["verbleibende Beeinträchtigung bei nicht vollständigem ökologischen Wertausgleich"]
[]
[]
[]
["Projektwirkung:"]

{"sheet":"A2 Zssfg Teilbilanzen","index":25,"n_rows":33,"n_cols":8,"rows_kept":33,"cut":false,"hidden":false,"merged":[[31,0,31,7],[32,0,32,7],[33,0,33,7],[28,0,28,7],[29,0,29,1],[29,2,29,3],[29,4,29,7],[30,0,30,1],[30,4,30,7],[25,0,25,7],[0,0,0,6],[2,1,2,6],[3,1,3,6],[5,0,5,7],[13,3,13,5],[15,0,15,7],[16,6,16,7],[17,0,17,5],[22,0,22,5],[23,0,23,7],[24,0,24,7]]}
["ZUSAMMENFASSUNG DER TEILBILANZEN EINER ALTERNATIVE",null,null,null,null,null,null,"A2"]
[]
["PROJEKT",{"$f":"IF(Projektgrunddaten!C3=0,\"\",Projektgrunddaten!C3)","v":""}]
["Alternative",{"$f":"IF(Projektgrunddaten!D15=0,\"\",Projektgrunddaten!D15)","v":"Name Alternative 2"}]
[]
["TEILBILANZ 1"]
[]
[{"$f":"'A2 monetäre  ökonom Effizienz'!A12","v":"PROJEKTNUTZENBARWERT"},null,null,null,null,null,null,{"$f":"'A2 monetäre  ökonom Effizienz'!E13","v":0}]
[{"$f":"'A2 monetäre  ökonom Effizienz'!A32","v":"PROJEKTKOSTENBARWERT"},null,null,null,null,null,null,{"$f":"'A2 monetäre  ökonom Effizienz'!E32","v":0}]
[]
[{"$f":"'A2 monetäre  ökonom Effizienz'!A34","v":"KAPITALWERT KW"},null,null,null,null,null,null,{"$f":"'A2 monetäre  ökonom Effizienz'!E35","v":0}]
[{"$f":"'A2 monetäre  ökonom Effizienz'!A39","v":"NUTZEN-KOSTEN-VERHÄLTNIS NKV"},null,null,null,null,null,null,{"$f":"'A2 monetäre  ökonom Effizienz'!E40","v":0}]
[]
["ERGEBNIS TEILBILANZ 1",null,null,"Absolute Wirtschaftlichkeit ",null,null,{"$f":"IF(H12>=1, \"gegeben\", \"nicht gegeben\")","v":"nicht gegeben"}]
[]
["TEILBILANZ 2"]
[null,null,null,null,null,null,"Beurteilung"]
[{"$f":"'A2 Weitere Projektwirkungen'!A3:H3","v":"Beurteilung der Personengefährdung"},null,null,null,null,null,{"$f":"'A2 Weitere Projektwirkungen'!D11","v":0},{"$f":"'A2 Weitere Projektwirkungen'!E11","v":0}]
[{"$f":"'A2 Weitere Projektwirkungen'!A13:H13","v":"Monetär nicht bewertete oder nicht bewertbare ökonomische Nutzen "},null,null,null,null,null,{"$f":"'A2 Weitere Projektwirkungen'!D22","v":0},{"$f":"'A2 Weitere Projektwirkungen'!E22","v":0}]
[{"$f":"'A2 Weitere Projektwirkungen'!A24:H24","v":"Außerökonomische soziokulturelle Effekte"},null,null,null,null,null,{"$f":"'A2 Weitere Projektwirkungen'!D30","v":0},{"$f":"'A2 Weitere Projektwirkungen'!E30","v":0}]
[{"$f":"'A2 Weitere Projektwirkungen'!A32:H32","v":"Ökologische Aspekte"},null,null,null,null,null,{"$f":"'A2 Weitere Projektwirkungen'!D38","v":0},{"$f":"'A2 Weitere Projektwirkungen'!E38","v":0}]
[]
["ERGEBNIS TEILBILANZ 2"]
["Kurze schriftliche Würdigung der Gesamtbewertung von Teilbilanz 2"]
[]
["GESAMTBEURTEILUNG VON TEILBILANZ 1 und 2"]
[]
["Anmerkung:"]
["Bei einheitlich positiver oder negativer Bewertung der Teilbilanzen 1 und 2 wird das Projekt als gesamtgesellschaftlich vorteilhaft oder nicht vorteilhaft beurteilt. Bei unterschiedlicher Bewertung von Teilbilanz 1 oder 2 ist im freien Feld unter \"Abwägung und Würdigung\" das Projekt als vorteilhaft oder nicht vorteilhaft zu beurteilen und eine Begründung für diese Abwägung zu übermitteln."]
["Teilbilanz 1",null,"Teilbilanz 2",null,"Abwägung und Würdigung"]
[{"$f":"IF(H12>=1, \"positiv\", \"negativ\")","v":"negativ"},null,{"$f":"G23","v":0},{"$f":"H23","v":0}]
[]
["BEGRÜNDUNG DER VORTEILHAFTEN / NICHT VORTEILHAFTEN WÜRDIGUNG"]

{"sheet":"A3 Kostenermittlung","index":26,"n_rows":40,"n_cols":4,"rows_kept":40,"cut":false,"hidden":false,"merged":[[0,0,0,2],[6,0,6,3],[24,0,24,3],[31,0,31,3]]}
["KOSTENERMITTLUNG",null,null,"A3"]
[]
["Bauzeit (Jahre)"]
["Betriebsbeginn"]
["Untersuchungszeitraum (Jahre)",80]
[]
["HERSTELLUNGSKOSTEN"]
[null,null,"Teilsummen Baukosten","Summe Herstellungskosten"]
["Kosten der Projektierung"]
["Baukosten"]
["davon für"]
["Dämme und Absperrbauwerke"]
["Stahlwasserbau"]
["maschinenbauliche, elektrische  Anlagenteile"]
["ingenieurbiologische Maßnahmen"]
[]
["Grunderwerbskosten "]
["Allfällige Ablösen"]
[]
["Herstellungskosten gesamt",null,null,{"$f":"SUM(D9+D10+D17+D18)","v":0}]
["Herstellungskosten pro Jahr",null,null,{"$f":"IF(ISNUMBER(D20/B3),(D20/B3),0)","v":0}]
[]
["Akkumulationsfaktor für Herstellungskosten (Reihe):",{"$f":"IF(ISNUMBER(VLOOKUP(B3,Faktoren!A2:E101,5,0)),(VLOOKUP(B3,Faktoren!A2:E101,5,0)),0)","v":0}]
["BARWERT DER HERSTELLUNGSKOSTEN",null,null,{"$f":"(B23*D21)-D17*(VLOOKUP(B5,Faktoren!A2:E101,2,0))","v":0}]
["REINVESTITIONSKOSTEN"]
[null,"Nutzungsdauer \nin Jahren"]
["Stahlwasserbau",40,null,{"$f":"C27*(VLOOKUP(B27,Faktoren!A2:E101,2,0))","v":0}]
["maschinenbauliche, elektrische  Anlagenteile",20,null,{"$f":"C28*((VLOOKUP(B28,Faktoren!A3:E102,2,0))+(VLOOKUP(2*B28,Faktoren!A3:E102,2,0))+(VLOOKUP(3*B28,Faktoren!A3:E102,2,0)))","v":0}]
["ingenieurbiologische Maßnahmen",40,null,{"$f":"C29*(VLOOKUP(B29,Faktoren!A4:E103,2,0))","v":0}]
["BARWERT DER REINVESTITIONSKOSTEN",null,null,{"$f":"SUM(D27:D29)","v":0}]
[]
["INSTANDHALTUNGSKOSTEN"]
["Jährliche Instandhaltungskosten für technische Anlagen ohne ingenieurbiologische Maßnahmen",null,null,{"$f":"SUM(C13+C14+C12)*0.005","v":0}]
["Jährliche Instandhaltungskosten ingenieurbiologische Maßnahmen",null,null,{"$f":"C15*0.01","v":0}]
["Summe jährliche Instandhaltungskosten ",null,null,{"$f":"SUM(D33:D34)","v":0}]
[]
["Diskontierungsfaktor Instandhaltungskosten (Reihe):",{"$f":"VLOOKUP(B5,Faktoren!A2:E101,3,0)","v":26.74877566600269}]
["BARWERT DER INSTANDHALTUNGSKOSTEN",null,null,{"$f":"D35*B37","v":0}]
[]
["PROJEKTKOSTENBARWERT",null,null,{"$f":"IF(ISNUMBER(SUM(D24+D30+D38)),(SUM(D24+D30+D38)),0)","v":0}]

{"sheet":"A3 monetäre  ökonom Effizienz","index":27,"n_rows":42,"n_cols":5,"rows_kept":42,"cut":false,"hidden":false,"merged":[[0,0,0,3],[16,1,16,4]]}
["MONETÄR BELEGTE ÖKONOMISCHE EFFIZIENZ",null,null,null,"A3"]
["NUTZENSCHÄTZUNG"]
[]
["Kalkulationsparameter"]
["Untersuchungszeitraum",{"$f":"'A3 Kostenermittlung'!B5","v":80},"Jahre"]
["Zinsatz p.a.",3.5000000000000003E-2,"p.a."]
["Erwartungswert der Schadensminderung",{"$f":"IF(Berechnungsgrundlagen!I8=1,Schadenserwartungen!H18,Schadenserwartungen!U18)","v":0},"p.a."]
["Diskontierungsfaktor Schadensminderung (Reihe)",null,{"$f":"VLOOKUP(B5,Faktoren!A2:E101,3,0)","v":26.74877566600269}]
["Berücksichtigung von Wertsteigerungen ","1% p.a",34.686999999999998]
[null,"2% p.a",46.8508]
[]
["PROJEKTNUTZENBARWERT"]
["ohne Berücksichtigung von Wertsteigerungen",null,null,null,{"$f":"B7*C8","v":0}]
["mit Berücksichtigung 1% Wertsteigerung",null,null,null,{"$f":"B7*C9","v":0}]
["mit Berücksichtigung 2% Wertsteigerung",null,null,null,{"$f":"B7*C10","v":0}]
["KOSTENSCHÄTZUNG"]
["Projektsalternative",{"$f":"IF(Projektgrunddaten!D17=0,\"\",Projektgrunddaten!D17)","v":"Name Alternative 3"}]
[]
["BARWERT DER HERSTELLUNGSKOSTEN",null,null,null,{"$f":"IF(ISNUMBER('A3 Kostenermittlung'!D24),'A3 Kostenermittlung'!D24,0)","v":0}]
["Projektierung",null,{"$f":"'A3 Kostenermittlung'!D9","v":0}]
["Baukosten",null,{"$f":"'A3 Kostenermittlung'!D10","v":0}]
["davon ingenieurbiologische Maßnahmen",null,{"$f":"'A3 Kostenermittlung'!C15","v":0}]
["Grunderwerbskosten incl. allfälliger Ablösen",null,{"$f":"'A3 Kostenermittlung'!D17","v":0}]
[]
[null,null,null,null,{"$f":"'A3 Kostenermittlung'!D30","v":0}]
[{"$f":"'A3 Kostenermittlung'!A30","v":"BARWERT DER REINVESTITIONSKOSTEN"}]
[]
[]
["BARWERT DER INSTANDHALTUNGSKOSTEN",null,null,null,{"$f":"'A3 Kostenermittlung'!D38","v":0}]
[]
[]
["PROJEKTKOSTENBARWERT",null,null,null,{"$f":"SUM(E19:E29)","v":0}]
[]
["KAPITALWERT KW"]
["ohne Berücksichtigung von Wertsteigerungen",null,null,null,{"$f":"E13-E32","v":0}]
["mit Berücksichtigung 1% Wertsteigerung",null,null,null,{"$f":"E14-E32","v":0}]
["mit Berücksichtigung 2% Wertsteigerung",null,null,null,{"$f":"E15-E32","v":0}]
[]
["NUTZEN-KOSTEN-VERHÄLTNIS NKV"]
["ohne Berücksichtigung von Wertsteigerungen",null,null,null,{"$f":"IF(ISNUMBER(ROUND(E13/E32,2)),(ROUND(E13/E32,2)),0)","v":0}]
["mit Berücksichtigung 1% Wertsteigerung",null,null,null,{"$f":"IF(ISNUMBER(ROUND(E14/E32,2)),(ROUND(E14/E32,2)),0)","v":0}]
["mit Berücksichtigung 2% Wertsteigerung",null,null,null,{"$f":"IF(ISNUMBER(ROUND(E15/E32,2)),(ROUND(E15/E32,2)),0)","v":0}]

{"sheet":"A3 Weitere Projektwirkungen","index":28,"n_rows":38,"n_cols":8,"rows_kept":38,"cut":false,"hidden":false,"merged":[[32,0,32,4],[33,0,33,5],[34,0,35,7],[36,0,36,7],[38,0,38,7],[31,0,31,7],[16,2,16,6],[17,0,18,7],[19,0,19,7],[20,0,20,7],[22,0,22,7],[23,0,23,7],[24,0,24,5],[25,0,25,5],[26,0,27,7],[28,0,28,7],[30,0,30,7],[15,2,15,6],[0,0,0,6],[2,0,2,7],[4,0,4,5],[5,0,5,5],[6,0,6,5],[7,0,8,7],[9,0,9,7],[11,0,11,7],[12,0,12,7],[13,2,13,6],[14,2,14,6]]}
["DARSTELLUNG UND BEURTEILUNG DER WEITEREN PROJEKTWIRKUNGEN",null,null,null,null,null,null,"A3"]
[]
["Beurteilung der Personengefährdung"]
[null,null,null,null,null,null,"direkt","indirekt"]
["Anzahl direkt und indirekt betroffener Personen bei HQ100:"]
["physische Betroffenheit (Gefahr für Leib und Leben)"]
["psychische Betroffenheit (Stress, Traumata, subjektives Sicherheitsgefühl)"]
[]
[]
[]
["Projektwirkung:"]
[]
["Monetär nicht bewertete oder nicht bewertbare ökonomische Nutzen "]
["nicht bewertete sind: ",null,"grundsätzlich bewertbare Nutzen, die z.B. wegen geringer Auswirkungen nicht monetär bewertet werden (Gründe sind hier zu beschreiben)"]
["nicht bewertbar sind:",null,"Prosperitätsschäden, Standortsicherung (Auswirkungen eines Hochwassers auf die Wirtschaftskraft einer Region)"]
[null,null,"Gefährdung sicherheitsrelevanter Einrichtungen"]
[null,null,"Nutzungseinschränkungen bei Ver- und Entsorgungsinfrastruktur"]
[]
[]
[]
[]
["Projektwirkung:"]
[]
["Außerökonomische soziokulturelle Effekte"]
["Auswirkungen auf die Lebensqualität und den Erholungswert"]
["Auswirkungen auf Kulturgüter"]
[]
[]
[]
["Projektwirkung:"]
[]
["Ökologische Aspekte"]
["Verbesserung der ökologischen Situation"]
["verbleibende Beeinträchtigung bei nicht vollständigem ökologischen Wertausgleich"]
[]
[]
[]
["Projektwirkung:"]

{"sheet":"A3 Zssfg Teilbilanzen","index":29,"n_rows":33,"n_cols":8,"rows_kept":33,"cut":false,"hidden":false,"merged":[[31,0,31,7],[32,0,32,7],[33,0,33,7],[28,0,28,7],[29,0,29,1],[29,2,29,3],[29,4,29,7],[30,0,30,1],[30,4,30,7],[25,0,25,7],[0,0,0,6],[2,1,2,6],[3,1,3,6],[5,0,5,7],[13,3,13,5],[15,0,15,7],[16,6,16,7],[17,0,17,5],[22,0,22,5],[23,0,23,7],[24,0,24,7]]}
["ZUSAMMENFASSUNG DER TEILBILANZEN EINER ALTERNATIVE",null,null,null,null,null,null,"A3"]
[]
["PROJEKT",{"$f":"IF(Projektgrunddaten!C3=0,\"\",Projektgrunddaten!C3)","v":""}]
["Alternative",{"$f":"IF(Projektgrunddaten!D17=0,\"\",Projektgrunddaten!D17)","v":"Name Alternative 3"}]
[]
["TEILBILANZ 1"]
[]
[{"$f":"'A3 monetäre  ökonom Effizienz'!A12","v":"PROJEKTNUTZENBARWERT"},null,null,null,null,null,null,{"$f":"'A3 monetäre  ökonom Effizienz'!E13","v":0}]
[{"$f":"'A3 monetäre  ökonom Effizienz'!A32","v":"PROJEKTKOSTENBARWERT"},null,null,null,null,null,null,{"$f":"'A3 monetäre  ökonom Effizienz'!E32","v":0}]
[]
[{"$f":"'A3 monetäre  ökonom Effizienz'!A34","v":"KAPITALWERT KW"},null,null,null,null,null,null,{"$f":"'A3 monetäre  ökonom Effizienz'!E35","v":0}]
[{"$f":"'A3 monetäre  ökonom Effizienz'!A39","v":"NUTZEN-KOSTEN-VERHÄLTNIS NKV"},null,null,null,null,null,null,{"$f":"'A3 monetäre  ökonom Effizienz'!E40","v":0}]
[]
["ERGEBNIS TEILBILANZ 1",null,null,"Absolute Wirtschaftlichkeit ",null,null,{"$f":"IF(H12>=1, \"gegeben\", \"nicht gegeben\")","v":"nicht gegeben"}]
[]
["TEILBILANZ 2"]
[null,null,null,null,null,null,"Beurteilung"]
[{"$f":"'A3 Weitere Projektwirkungen'!A3:H3","v":"Beurteilung der Personengefährdung"},null,null,null,null,null,{"$f":"'A3 Weitere Projektwirkungen'!D11","v":0},{"$f":"'A3 Weitere Projektwirkungen'!E11","v":0}]
[{"$f":"'A3 Weitere Projektwirkungen'!A13:H13","v":"Monetär nicht bewertete oder nicht bewertbare ökonomische Nutzen "},null,null,null,null,null,{"$f":"'A3 Weitere Projektwirkungen'!D22","v":0},{"$f":"'A3 Weitere Projektwirkungen'!E22","v":0}]
[{"$f":"'A3 Weitere Projektwirkungen'!A24:H24","v":"Außerökonomische soziokulturelle Effekte"},null,null,null,null,null,{"$f":"'A3 Weitere Projektwirkungen'!D30","v":0},{"$f":"'A3 Weitere Projektwirkungen'!E30","v":0}]
[{"$f":"'A3 Weitere Projektwirkungen'!A32:H32","v":"Ökologische Aspekte"},null,null,null,null,null,{"$f":"'A3 Weitere Projektwirkungen'!D38","v":0},{"$f":"'A3 Weitere Projektwirkungen'!E38","v":0}]
[]
["ERGEBNIS TEILBILANZ 2"]
["Kurze schriftliche Würdigung der Gesamtbewertung von Teilbilanz 2"]
[]
["GESAMTBEURTEILUNG VON TEILBILANZ 1 und 2"]
[]
["Anmerkung:"]
["Bei einheitlich positiver oder negativer Bewertung der Teilbilanzen 1 und 2 wird das Projekt als gesamtgesellschaftlich vorteilhaft oder nicht vorteilhaft beurteilt. Bei unterschiedlicher Bewertung von Teilbilanz 1 oder 2 ist im freien Feld unter \"Abwägung und Würdigung\" das Projekt als vorteilhaft oder nicht vorteilhaft zu beurteilen und eine Begründung für diese Abwägung zu übermitteln."]
["Teilbilanz 1",null,"Teilbilanz 2",null,"Abwägung und Würdigung"]
[{"$f":"IF(H12>=1, \"positiv\", \"negativ\")","v":"negativ"},null,{"$f":"G23","v":0},{"$f":"H23","v":0}]
[]
["BEGRÜNDUNG DER VORTEILHAFTEN / NICHT VORTEILHAFTEN WÜRDIGUNG"]

{"sheet":"A4 Kostenermittlung","index":30,"n_rows":40,"n_cols":4,"rows_kept":40,"cut":false,"hidden":false,"merged":[[0,0,0,2],[6,0,6,3],[24,0,24,3],[31,0,31,3]]}
["KOSTENERMITTLUNG",null,null,"A4"]
[]
["Bauzeit (Jahre)"]
["Betriebsbeginn"]
["Untersuchungszeitraum (Jahre)",80]
[]
["HERSTELLUNGSKOSTEN"]
[null,null,"Teilsummen Baukosten","Summe Herstellungskosten"]
["Kosten der Projektierung"]
["Baukosten"]
["davon für"]
["Dämme und Absperrbauwerke"]
["Stahlwasserbau"]
["maschinenbauliche, elektrische  Anlagenteile"]
["ingenieurbiologische Maßnahmen"]
[]
["Grunderwerbskosten "]
["Allfällige Ablösen"]
[]
["Herstellungskosten gesamt",null,null,{"$f":"SUM(D9+D10+D17+D18)","v":0}]
["Herstellungskosten pro Jahr",null,null,{"$f":"IF(ISNUMBER(D20/B3),(D20/B3),0)","v":0}]
[]
["Akkumulationsfaktor für Herstellungskosten (Reihe):",{"$f":"IF(ISNUMBER(VLOOKUP(B3,Faktoren!A2:E101,5,0)),(VLOOKUP(B3,Faktoren!A2:E101,5,0)),0)","v":0}]
["BARWERT DER HERSTELLUNGSKOSTEN",null,null,{"$f":"(B23*D21)-D17*(VLOOKUP(B5,Faktoren!A2:E101,2,0))","v":0}]
["REINVESTITIONSKOSTEN"]
[null,"Nutzungsdauer \nin Jahren"]
["Stahlwasserbau",40,null,{"$f":"C27*(VLOOKUP(B27,Faktoren!A2:E101,2,0))","v":0}]
["maschinenbauliche, elektrische  Anlagenteile",20,null,{"$f":"C28*((VLOOKUP(B28,Faktoren!A3:E102,2,0))+(VLOOKUP(2*B28,Faktoren!A3:E102,2,0))+(VLOOKUP(3*B28,Faktoren!A3:E102,2,0)))","v":0}]
["ingenieurbiologische Maßnahmen",40,null,{"$f":"C29*(VLOOKUP(B29,Faktoren!A4:E103,2,0))","v":0}]
["BARWERT DER REINVESTITIONSKOSTEN",null,null,{"$f":"SUM(D27:D29)","v":0}]
[]
["INSTANDHALTUNGSKOSTEN"]
["Jährliche Instandhaltungskosten für technische Anlagen ohne ingenieurbiologische Maßnahmen",null,null,{"$f":"SUM(C13+C14+C12)*0.005","v":0}]
["Jährliche Instandhaltungskosten ingenieurbiologische Maßnahmen",null,null,{"$f":"C15*0.01","v":0}]
["Summe jährliche Instandhaltungskosten ",null,null,{"$f":"SUM(D33:D34)","v":0}]
[]
["Diskontierungsfaktor Instandhaltungskosten (Reihe):",{"$f":"VLOOKUP(B5,Faktoren!A2:E101,3,0)","v":26.74877566600269}]
["BARWERT DER INSTANDHALTUNGSKOSTEN",null,null,{"$f":"D35*B37","v":0}]
[]
["PROJEKTKOSTENBARWERT",null,null,{"$f":"IF(ISNUMBER(SUM(D24+D30+D38)),(SUM(D24+D30+D38)),0)","v":0}]

{"sheet":"A4 monetäre  ökonom Effizienz","index":31,"n_rows":42,"n_cols":5,"rows_kept":42,"cut":false,"hidden":false,"merged":[[0,0,0,3],[16,1,16,4]]}
["MONETÄR BELEGTE ÖKONOMISCHE EFFIZIENZ",null,null,null,"A4"]
["NUTZENSCHÄTZUNG"]
[]
["Kalkulationsparameter"]
["Untersuchungszeitraum",{"$f":"'A4 Kostenermittlung'!B5","v":80},"Jahre"]
["Zinsatz p.a.",3.5000000000000003E-2,"p.a."]
["Erwartungswert der Schadensminderung",{"$f":"IF(Berechnungsgrundlagen!I9=1,Schadenserwartungen!H18,Schadenserwartungen!U18)","v":0},"p.a."]
["Diskontierungsfaktor Schadensminderung (Reihe)",null,{"$f":"VLOOKUP(B5,Faktoren!A2:E101,3,0)","v":26.74877566600269}]
["Berücksichtigung von Wertsteigerungen ","1% p.a",34.686999999999998]
[null,"2% p.a",46.8508]
[]
["PROJEKTNUTZENBARWERT"]
["ohne Berücksichtigung von Wertsteigerungen",null,null,null,{"$f":"B7*C8","v":0}]
["mit Berücksichtigung 1% Wertsteigerung",null,null,null,{"$f":"B7*C9","v":0}]
["mit Berücksichtigung 2% Wertsteigerung",null,null,null,{"$f":"B7*C10","v":0}]
["KOSTENSCHÄTZUNG"]
["Projektsalternative",{"$f":"IF(Projektgrunddaten!D19=0,\"\",Projektgrunddaten!D19)","v":"Name Alternative 4"}]
[]
["BARWERT DER HERSTELLUNGSKOSTEN",null,null,null,{"$f":"IF(ISNUMBER('A4 Kostenermittlung'!D24),('A4 Kostenermittlung'!D24),0)","v":0}]
["Projektierung",null,{"$f":"'A4 Kostenermittlung'!D9","v":0}]
["Baukosten",null,{"$f":"'A4 Kostenermittlung'!D10","v":0}]
["davon ingenieurbiologische Maßnahmen",null,{"$f":"'A4 Kostenermittlung'!C15","v":0}]
["Grunderwerbskosten incl. allfälliger Ablösen",null,{"$f":"'A4 Kostenermittlung'!D17","v":0}]
[]
[null,null,null,null,{"$f":"'A4 Kostenermittlung'!D30","v":0}]
[{"$f":"'A4 Kostenermittlung'!A30","v":"BARWERT DER REINVESTITIONSKOSTEN"}]
[]
[]
["BARWERT DER INSTANDHALTUNGSKOSTEN",null,null,null,{"$f":"'A4 Kostenermittlung'!D38","v":0}]
[]
[]
["PROJEKTKOSTENBARWERT",null,null,null,{"$f":"SUM(E19:E29)","v":0}]
[]
["KAPITALWERT KW"]
["ohne Berücksichtigung von Wertsteigerungen",null,null,null,{"$f":"E13-E32","v":0}]
["mit Berücksichtigung 1% Wertsteigerung",null,null,null,{"$f":"E14-E32","v":0}]
["mit Berücksichtigung 2% Wertsteigerung",null,null,null,{"$f":"E15-E32","v":0}]
[]
["NUTZEN-KOSTEN-VERHÄLTNIS NKV"]
["ohne Berücksichtigung von Wertsteigerungen",null,null,null,{"$f":"IF(ISNUMBER(ROUND(E13/E32,2)),(ROUND(E13/E32,2)),0)","v":0}]
["mit Berücksichtigung 1% Wertsteigerung",null,null,null,{"$f":"IF(ISNUMBER(ROUND(E14/E32,2)),(ROUND(E14/E32,2)),0)","v":0}]
["mit Berücksichtigung 2% Wertsteigerung",null,null,null,{"$f":"IF(ISNUMBER(ROUND(E15/E32,2)),(ROUND(E15/E32,2)),0)","v":0}]

{"sheet":"A4 Weitere Projektwirkungen","index":32,"n_rows":38,"n_cols":8,"rows_kept":38,"cut":false,"hidden":false,"merged":[[32,0,32,4],[33,0,33,5],[34,0,35,7],[36,0,36,7],[38,0,38,7],[31,0,31,7],[16,2,16,6],[17,0,18,7],[19,0,19,7],[20,0,20,7],[22,0,22,7],[23,0,23,7],[24,0,24,5],[25,0,25,5],[26,0,27,7],[28,0,28,7],[30,0,30,7],[15,2,15,6],[0,0,0,6],[2,0,2,7],[4,0,4,5],[5,0,5,5],[6,0,6,5],[7,0,8,7],[9,0,9,7],[11,0,11,7],[12,0,12,7],[13,2,13,6],[14,2,14,6]]}
["DARSTELLUNG UND BEURTEILUNG DER WEITEREN PROJEKTWIRKUNGEN",null,null,null,null,null,null,"A4"]
[]
["Beurteilung der Personengefährdung"]
[null,null,null,null,null,null,"direkt","indirekt"]
["Anzahl direkt und indirekt betroffener Personen bei HQ100:"]
["physische Betroffenheit (Gefahr für Leib und Leben)"]
["psychische Betroffenheit (Stress, Traumata, subjektives Sicherheitsgefühl)"]
[]
[]
[]
["Projektwirkung:"]
[]
["Monetär nicht bewertete oder nicht bewertbare ökonomische Nutzen "]
["nicht bewertete sind: ",null,"grundsätzlich bewertbare Nutzen, die z.B. wegen geringer Auswirkungen nicht monetär bewertet werden (Gründe sind hier zu beschreiben)"]
["nicht bewertbar sind:",null,"Prosperitätsschäden, Standortsicherung (Auswirkungen eines Hochwassers auf die Wirtschaftskraft einer Region)"]
[null,null,"Gefährdung sicherheitsrelevanter Einrichtungen"]
[null,null,"Nutzungseinschränkungen bei Ver- und Entsorgungsinfrastruktur"]
[]
[]
[]
[]
["Projektwirkung:"]
[]
["Außerökonomische soziokulturelle Effekte"]
["Auswirkungen auf die Lebensqualität und den Erholungswert"]
["Auswirkungen auf Kulturgüter"]
[]
[]
[]
["Projektwirkung:"]
[]
["Ökologische Aspekte"]
["Verbesserung der ökologischen Situation"]
["verbleibende Beeinträchtigung bei nicht vollständigem ökologischen Wertausgleich"]
[]
[]
[]
["Projektwirkung:"]

{"sheet":"A4 Zssfg Teilbilanzen","index":33,"n_rows":33,"n_cols":8,"rows_kept":33,"cut":false,"hidden":false,"merged":[[31,0,31,7],[32,0,32,7],[33,0,33,7],[28,0,28,7],[29,0,29,1],[29,2,29,3],[29,4,29,7],[30,0,30,1],[30,4,30,7],[25,0,25,7],[0,0,0,6],[2,1,2,6],[3,1,3,6],[5,0,5,7],[13,3,13,5],[15,0,15,7],[16,6,16,7],[17,0,17,5],[22,0,22,5],[23,0,23,7],[24,0,24,7]]}
["ZUSAMMENFASSUNG DER TEILBILANZEN EINER ALTERNATIVE",null,null,null,null,null,null,"A4"]
[]
["PROJEKT",{"$f":"IF(Projektgrunddaten!C3=0,\"\",Projektgrunddaten!C3)","v":""}]
["Alternative",{"$f":"IF(Projektgrunddaten!D19=0,\"\",Projektgrunddaten!D19)","v":"Name Alternative 4"}]
[]
["TEILBILANZ 1"]
[]
[{"$f":"'A4 monetäre  ökonom Effizienz'!A12","v":"PROJEKTNUTZENBARWERT"},null,null,null,null,null,null,{"$f":"'A4 monetäre  ökonom Effizienz'!E13","v":0}]
[{"$f":"'A4 monetäre  ökonom Effizienz'!A32","v":"PROJEKTKOSTENBARWERT"},null,null,null,null,null,null,{"$f":"'A4 monetäre  ökonom Effizienz'!E32","v":0}]
[]
[{"$f":"'A4 monetäre  ökonom Effizienz'!A34","v":"KAPITALWERT KW"},null,null,null,null,null,null,{"$f":"'A4 monetäre  ökonom Effizienz'!E35","v":0}]
[{"$f":"'A4 monetäre  ökonom Effizienz'!A39","v":"NUTZEN-KOSTEN-VERHÄLTNIS NKV"},null,null,null,null,null,null,{"$f":"'A4 monetäre  ökonom Effizienz'!E40","v":0}]
[]
["ERGEBNIS TEILBILANZ 1",null,null,"Absolute Wirtschaftlichkeit ",null,null,{"$f":"IF(H12>=1, \"gegeben\", \"nicht gegeben\")","v":"nicht gegeben"}]
[]
["TEILBILANZ 2"]
[null,null,null,null,null,null,"Beurteilung"]
[{"$f":"'A4 Weitere Projektwirkungen'!A3:H3","v":"Beurteilung der Personengefährdung"},null,null,null,null,null,{"$f":"'A4 Weitere Projektwirkungen'!D11","v":0},{"$f":"'A4 Weitere Projektwirkungen'!E11","v":0}]
[{"$f":"'A4 Weitere Projektwirkungen'!A13:H13","v":"Monetär nicht bewertete oder nicht bewertbare ökonomische Nutzen "},null,null,null,null,null,{"$f":"'A4 Weitere Projektwirkungen'!D22","v":0},{"$f":"'A4 Weitere Projektwirkungen'!E22","v":0}]
[{"$f":"'A4 Weitere Projektwirkungen'!A24:H24","v":"Außerökonomische soziokulturelle Effekte"},null,null,null,null,null,{"$f":"'A4 Weitere Projektwirkungen'!D30","v":0},{"$f":"'A4 Weitere Projektwirkungen'!E30","v":0}]
[{"$f":"'A4 Weitere Projektwirkungen'!A32:H32","v":"Ökologische Aspekte"},null,null,null,null,null,{"$f":"'A4 Weitere Projektwirkungen'!D38","v":0},{"$f":"'A4 Weitere Projektwirkungen'!E38","v":0}]
[]
["ERGEBNIS TEILBILANZ 2"]
["Kurze schriftliche Würdigung der Gesamtbewertung von Teilbilanz 2"]
[]
["GESAMTBEURTEILUNG VON TEILBILANZ 1 und 2"]
[]
["Anmerkung:"]
["Bei einheitlich positiver oder negativer Bewertung der Teilbilanzen 1 und 2 wird das Projekt als gesamtgesellschaftlich vorteilhaft oder nicht vorteilhaft beurteilt. Bei unterschiedlicher Bewertung von Teilbilanz 1 oder 2 ist im freien Feld unter \"Abwägung und Würdigung\" das Projekt als vorteilhaft oder nicht vorteilhaft zu beurteilen und eine Begründung für diese Abwägung zu übermitteln."]
["Teilbilanz 1",null,"Teilbilanz 2",null,"Abwägung und Würdigung"]
[{"$f":"IF(H12>=1, \"positiv\", \"negativ\")","v":"negativ"},null,{"$f":"G23","v":0},{"$f":"H23","v":0}]
[]
["BEGRÜNDUNG DER VORTEILHAFTEN / NICHT VORTEILHAFTEN WÜRDIGUNG"]

{"sheet":"Alternativenvergleich","index":34,"n_rows":24,"n_cols":12,"rows_kept":24,"cut":false,"hidden":false,"merged":[[23,0,23,12],[24,0,24,12],[3,1,3,2],[3,4,3,5],[3,7,3,8],[3,10,3,11],[19,1,19,2],[19,4,19,5],[19,7,19,8],[19,10,19,11],[2,1,2,3],[2,4,2,6],[2,7,2,9],[2,10,2,12],[0,0,0,12],[1,1,1,2],[1,4,1,5],[1,7,1,8],[1,10,1,11]]}
["ALTERNATIVENVERGLEICH"]
[null,"Alternative 1",null,null,"Alternative 2",null,null,"Alternative 3",null,null,"Alternative 4"]
["NAME",{"$f":"Projektgrunddaten!D13","v":"Name Alternative 1"},null,null,{"$f":"Projektgrunddaten!D15","v":"Name Alternative 2"},null,null,{"$f":"Projektgrunddaten!D17","v":"Name Alternative 3"},null,null,{"$f":"Projektgrunddaten!D19","v":"Name Alternative 4"}]
["TEILBILANZ 1"]
["Barwert der Herstellungskosten","€",{"$f":"'A1 Kostenermittlung'!$D$24","v":0},null,"€",{"$f":"'A2 Kostenermittlung'!$D$24","v":0},null,"€",{"$f":"'A3 Kostenermittlung'!$D$24","v":0},null,"€",{"$f":"'A4 Kostenermittlung'!$D$24","v":0}]
["Barwert der Reinvestitionskosten","€",{"$f":"'A1 Kostenermittlung'!$D$30","v":0},null,"€",{"$f":"'A2 Kostenermittlung'!$D$30","v":0},null,"€",{"$f":"'A3 Kostenermittlung'!$D$30","v":0},null,"€",{"$f":"'A4 Kostenermittlung'!$D$30","v":0}]
["Barwert der Instandhaltungskosten","€",{"$f":"'A1 Kostenermittlung'!$D$38","v":0},null,"€",{"$f":"'A2 Kostenermittlung'!$D$38","v":0},null,"€",{"$f":"'A3 Kostenermittlung'!$D$38","v":0},null,"€",{"$f":"'A4 Kostenermittlung'!$D$38","v":0}]
["Projektkostenbarwert","€",{"$f":"'A1 monetäre  ökonom Effizienz'!$E$32","v":0},null,"€",{"$f":"'A2 monetäre  ökonom Effizienz'!$E$32","v":0},null,"€",{"$f":"'A3 monetäre  ökonom Effizienz'!$E$32","v":0},null,"€",{"$f":"'A4 monetäre  ökonom Effizienz'!$E$32","v":0}]
["Projektnutzenbarwert","€",{"$f":"'A1 monetäre  ökonom Effizienz'!$E$13","v":0},null,"€",{"$f":"'A2 monetäre  ökonom Effizienz'!$E$13","v":0},null,"€",{"$f":"'A3 monetäre  ökonom Effizienz'!$E$13","v":0},null,"€",{"$f":"'A4 monetäre  ökonom Effizienz'!$E$13","v":0}]
["Kapitalwert KW","€",{"$f":"'A1 monetäre  ökonom Effizienz'!$E$35","v":0},null,"€",{"$f":"'A2 monetäre  ökonom Effizienz'!$E$35","v":0},null,null,{"$f":"'A3 monetäre  ökonom Effizienz'!$E$35","v":0},null,null,{"$f":"'A4 monetäre  ökonom Effizienz'!$E$35","v":0}]
["Nutzen-Kosten-Verhältnis NKV",null,{"$f":"'A1 monetäre  ökonom Effizienz'!$E$40","v":0},null,null,{"$f":"'A2 monetäre  ökonom Effizienz'!$E$40","v":0},null,null,{"$f":"'A3 monetäre  ökonom Effizienz'!$E$40","v":0},null,null,{"$f":"'A4 monetäre  ökonom Effizienz'!$E$40","v":0}]
[]
["TEILBILANZ 2"]
[{"$f":"'A1 Zssfg Teilbilanzen'!A18:F18","v":"Beurteilung der Personengefährdung"},{"$f":"'A1 Zssfg Teilbilanzen'!$G$18","v":0},{"$f":"'A1 Zssfg Teilbilanzen'!$H$18","v":0},null,{"$f":"'A2 Zssfg Teilbilanzen'!$G$18","v":0},{"$f":"'A2 Zssfg Teilbilanzen'!$H$18","v":0},null,{"$f":"'A3 Zssfg Teilbilanzen'!$G$18","v":0},{"$f":"'A3 Zssfg Teilbilanzen'!$H$18","v":0},null,{"$f":"'A4 Zssfg Teilbilanzen'!$G$18","v":0},{"$f":"'A4 Zssfg Teilbilanzen'!$H$18","v":0}]
[{"$f":"'A1 Zssfg Teilbilanzen'!A19:F19","v":"Monetär nicht bewertete oder nicht bewertbare ökonomische Nutzen "},{"$f":"'A1 Zssfg Teilbilanzen'!$G$19","v":0},{"$f":"'A1 Zssfg Teilbilanzen'!$H$19","v":0},null,{"$f":"'A2 Zssfg Teilbilanzen'!$G$19","v":0},{"$f":"'A2 Zssfg Teilbilanzen'!$H$19","v":0},null,{"$f":"'A3 Zssfg Teilbilanzen'!$G$19","v":0},{"$f":"'A3 Zssfg Teilbilanzen'!$H$19","v":0},null,{"$f":"'A4 Zssfg Teilbilanzen'!$G$19","v":0},{"$f":"'A4 Zssfg Teilbilanzen'!$H$19","v":0}]
[{"$f":"'A1 Zssfg Teilbilanzen'!A20:F20","v":"Außerökonomische soziokulturelle Effekte"},{"$f":"'A1 Zssfg Teilbilanzen'!$G$20","v":0},{"$f":"'A1 Zssfg Teilbilanzen'!$H$20","v":0},null,{"$f":"'A2 Zssfg Teilbilanzen'!$G$20","v":0},{"$f":"'A2 Zssfg Teilbilanzen'!$H$20","v":0},null,{"$f":"'A3 Zssfg Teilbilanzen'!$G$20","v":0},{"$f":"'A3 Zssfg Teilbilanzen'!$H$20","v":0},null,{"$f":"'A4 Zssfg Teilbilanzen'!$G$20","v":0},{"$f":"'A4 Zssfg Teilbilanzen'!$H$20","v":0}]
[{"$f":"'A1 Zssfg Teilbilanzen'!A21:F21","v":"Ökologische Aspekte"},{"$f":"'A1 Zssfg Teilbilanzen'!$G$21","v":0},{"$f":"'A1 Zssfg Teilbilanzen'!$H$21","v":0},null,{"$f":"'A2 Zssfg Teilbilanzen'!$G$21","v":0},{"$f":"'A2 Zssfg Teilbilanzen'!$H$21","v":0},null,{"$f":"'A3 Zssfg Teilbilanzen'!$G$21","v":0},{"$f":"'A3 Zssfg Teilbilanzen'!$H$21","v":0},null,{"$f":"'A4 Zssfg Teilbilanzen'!$G$21","v":0},{"$f":"'A4 Zssfg Teilbilanzen'!$H$21","v":0}]
["Ergebnis Teilbilanz 2",{"$f":"'A1 Zssfg Teilbilanzen'!$G$23","v":0},{"$f":"'A1 Zssfg Teilbilanzen'!$H$23","v":0},null,{"$f":"'A2 Zssfg Teilbilanzen'!$G$23","v":0},{"$f":"'A2 Zssfg Teilbilanzen'!$H$23","v":0},null,{"$f":"'A3 Zssfg Teilbilanzen'!$G$23","v":0},{"$f":"'A3 Zssfg Teilbilanzen'!$H$23","v":0},null,{"$f":"'A4 Zssfg Teilbilanzen'!$G$23","v":0},{"$f":"'A4 Zssfg Teilbilanzen'!$H$23","v":0}]
[]
["GESAMTBEURTEILUNG",{"$f":"'A1 Zssfg Teilbilanzen'!$E$31","v":0},null,null,{"$f":"'A2 Zssfg Teilbilanzen'!$E$31","v":0},null,null,{"$f":"'A3 Zssfg Teilbilanzen'!$E$31","v":0},null,null,{"$f":"'A4 Zssfg Teilbilanzen'!$E$31","v":0}]
[]
[]
["Gewählte Alternative:",1]
["AUSWAHL AUS DEN POSITIV BEURTEILTEN ALTERNATIVEN UND BEGRÜNDUNG DER ENTSCHEIDUNG"]

{"sheet":"Einordnung in integrales HWSM","index":35,"n_rows":3,"n_cols":1,"rows_kept":3,"cut":false,"hidden":false,"merged":[[0,0,0,8],[2,0,2,8],[3,0,3,8]]}
["EINORDNUNG IN DAS INTEGRALE HOCHWASSERSCHUTZMANAGEMENT"]
[]
["Informationen zu Personen- und Infrastrukturgefährdungen"]

{"sheet":"Detailliste Wirtschaftszweige","index":36,"n_rows":331,"n_cols":3,"rows_kept":331,"cut":false,"hidden":false,"merged":[[4,0,4,1],[0,0,0,1],[1,0,1,1],[2,0,2,1],[3,0,3,2]]}
[]
[]
[]
["Wirtschaftssektoren, Gliederung entsprechend ÖNACE"]
["ÖNACE-Gruppe",null,"Details"]
["B","BERGBAU UND GEWINNUNG VON STEINEN UND ERDEN","05  KOHLENBERGBAU "]
[null,null,"05.1  Steinkohlenbergbau "]
[null,null,"05.2  Braunkohlenbergbau "]
[null,null,"06  GEWINNUNG VON ERDÖL UND ERDGAS "]
[null,null,"06.1  Gewinnung von Erdöl "]
[null,null,"06.2  Gewinnung von Erdgas "]
[null,null,"07  ERZBERGBAU "]
[null,null,"07.1  Eisenerzbergbau "]
[null,null,"07.2  NE-Metallerzbergbau "]
[null,null,"08  GEWINNUNG VON STEINEN UND ERDEN, SONSTIGER BERGBAU "]
[null,null,"08.1  Gewinnung von Natursteinen, Kies, Sand, Ton und Kaolin "]
[null,null,"08.9  Sonstiger Bergbau; Gewinnung von Steinen und Erden a.n.g. "]
[null,null,"09  ERBRINGUNG VON DIENSTLEISTUNGEN FÜR DEN BERGBAU UND FÜR DIE GEWINNUNG VON STEINEN UND ERDEN "]
[null,null,"09.1  Erbringung von Dienstleistungen für die Gewinnung von Erdöl und Erdgas "]
[null,null,"09.9  Erbringung von Dienstleistungen für den sonstigen Bergbau und die Gewinnung von Steinen und Erden "]
[]
["C","HERSTELLUNG VON WAREN","10  HERSTELLUNG VON NAHRUNGS- UND FUTTERMITTELN "]
[null,null,"10.1  Schlachten und Fleischverarbeitung "]
[null,null,"10.2  Fischverarbeitung "]
[null,null,"10.3  Obst- und Gemüseverarbeitung "]
[null,null,"10.4  Herstellung von pflanzlichen und tierischen Ölen und Fetten "]
[null,null,"10.5  Milchverarbeitung "]
[null,null,"10.6  Mahl- und Schälmühlen, Herstellung von Stärke und Stärkeerzeugnissen "]
[null,null,"10.7  Herstellung von Back- und Teigwaren "]
[null,null,"10.8  Herstellung von sonstigen Nahrungsmitteln "]
[null,null,"10.9  Herstellung von Futtermitteln "]
[null,null,"11  GETRÄNKEHERSTELLUNG "]
[null,null,"11.0  Getränkeherstellung "]
[null,null,"12  TABAKVERARBEITUNG "]
[null,null,"12.0  Tabakverarbeitung "]
[null,null,"13  HERSTELLUNG VON TEXTILIEN "]
[null,null,"13.1  Spinnstoffaufbereitung und Spinnerei "]
[null,null,"13.2  Weberei "]
[null,null,"13.3  Veredlung von Textilien und Bekleidung "]
[null,null,"13.9  Herstellung von sonstigen Textilwaren "]
[null,null,"14  HERSTELLUNG VON BEKLEIDUNG "]
[null,null,"14.1  Herstellung von Bekleidung (ohne Pelzbekleidung) "]
[null,null,"14.2  Herstellung von Pelzwaren "]
[null,null,"14.3  Herstellung von Bekleidung aus gewirktem und gestricktem Stoff "]
[null,null,"15  HERSTELLUNG VON LEDER, LEDERWAREN UND SCHUHEN "]
[null,null,"15.1  Herstellung von Leder und Lederwaren (ohne Herstellung von Lederbekleidung) "]
[null,null,"15.2  Herstellung von Schuhen "]
[null,null,"16  HERSTELLUNG VON HOLZ-, FLECHT-, KORB- UND KORKWAREN (OHNE MÖBEL) "]
[null,null,"16.1  Säge-, Hobel- und Holzimprägnierwerke "]
[null,null,"16.2  Herstellung von sonstigen Holz-, Kork-, Flecht- und Korbwaren (ohne Möbel) "]
[null,null,"17  HERSTELLUNG VON PAPIER, PAPPE UND WAREN DARAUS "]
[null,null,"17.1  Herstellung von Holz- und Zellstoff, Papier, Karton und Pappe "]
[null,null,"17.2  Herstellung von Waren aus Papier, Karton und Pappe "]
[null,null,"18  HERSTELLUNG VON DRUCKERZEUGNISSEN; VERVIELFÄLTIGUNG VON BESPIELTEN TON-, BILD- UND DATENTRÄGERN "]
[null,null,"18.1  Herstellung von Druckerzeugnissen "]
[null,null,"18.2  Vervielfältigung von bespielten Ton-, Bild- und Datenträgern "]
[null,null,"19  KOKEREI UND MINERALÖLVERARBEITUNG "]
[null,null,"19.1  Kokerei "]
[null,null,"19.2  Mineralölverarbeitung "]
[null,null,"20  HERSTELLUNG VON CHEMISCHEN ERZEUGNISSEN "]
[null,null,"20.1  Herstellung von chemischen Grundstoffen, Düngemitteln und Stickstoffverbindungen, Kunststoffen in Primärformen und synthetischem Kautschuk in Primärformen "]
[null,null,"20.2  Herstellung von Schädlingsbekämpfungs-, Pflanzenschutz- und Desinfektionsmitteln "]
[null,null,"20.3  Herstellung von Anstrichmitteln, Druckfarben und Kitten "]
[null,null,"20.4  Herstellung von Seifen, Wasch-, Reinigungs- und Körperpflegemitteln sowie von Duftstoffen "]
[null,null,"20.5  Herstellung von sonstigen chemischen Erzeugnissen "]
[null,null,"20.6  Herstellung von Chemiefasern "]
[null,null,"21  HERSTELLUNG VON PHARMAZEUTISCHEN ERZEUGNISSEN "]
[null,null,"21.1  Herstellung von pharmazeutischen Grundstoffen "]
[null,null,"21.2  Herstellung von pharmazeutischen Spezialitäten und sonstigen pharmazeutischen Erzeugnissen "]
[null,null,"22  HERSTELLUNG VON GUMMI- UND KUNSTSTOFFWAREN "]
[null,null,"22.1  Herstellung von Gummiwaren "]
[null,null,"22.2  Herstellung von Kunststoffwaren "]
[null,null,"23  HERSTELLUNG VON GLAS UND GLASWAREN, KERAMIK, VERARBEITUNG VON STEINEN UND ERDEN "]
[null,null,"23.1  Herstellung von Glas und Glaswaren "]
[null,null,"23.2  Herstellung von feuerfesten keramischen Werkstoffen und Waren "]
[null,null,"23.3  Herstellung von keramischen Baumaterialien "]
[null,null,"23.4  Herstellung von sonstigen Porzellan- und keramischen Erzeugnissen "]
[null,null,"23.5  Herstellung von Zement, Kalk und gebranntem Gips "]
[null,null,"23.6  Herstellung von Erzeugnissen aus Beton, Zement und Gips "]
[null,null,"23.7  Be- und Verarbeitung von Naturwerksteinen und Natursteinen a.n.g. "]
[null,null,"23.9  Herstellung von Schleifkörpern und Schleifmitteln auf Unterlage sowie sonstigen Erzeugnissen aus nicht metallischen Mineralien a.n.g. "]
[null,null,"24  METALLERZEUGUNG UND -BEARBEITUNG "]
[null,null,"24.1  Erzeugung von Roheisen, Stahl und Ferrolegierungen "]
[null,null,"24.2  Herstellung von Stahlrohren, Rohrform-, Rohrverschluss- und Rohrverbindungsstücken aus Stahl "]
[null,null,"24.3  Sonstige erste Bearbeitung von Eisen und Stahl "]
[null,null,"24.4  Erzeugung und erste Bearbeitung von NE-Metallen "]
[null,null,"24.5  Gießereien "]
[null,null,"25  HERSTELLUNG VON METALLERZEUGNISSEN "]
[null,null,"25.1  Stahl- und Leichtmetallbau "]
[null,null,"25.2  Herstellung von Metalltanks und -behältern; Herstellung von Heizkörpern und -kesseln für Zentralheizungen "]
[null,null,"25.3  Herstellung von Dampfkesseln (ohne Zentralheizungskessel) "]
[null,null,"25.4  Herstellung von Waffen und Munition "]
[null,null,"25.5  Herstellung von Schmiede-, Press-, Zieh- und Stanzteilen, gewalzten Ringen und pulvermetallurgischen Erzeugnissen "]
[null,null,"25.6  Oberflächenveredlung und Wärmebehandlung; Mechanik a.n.g. "]
[null,null,"25.7  Herstellung von Schneidwaren, Werkzeugen, Schlössern und Beschlägen aus unedlen Metallen "]
[null,null,"25.9  Herstellung von sonstigen Metallwaren "]
[null,null,"26  HERSTELLUNG VON DATENVERARBEITUNGSGERÄTEN, ELEKTRONISCHEN UND OPTISCHEN ERZEUGNISSEN "]
[null,null,"26.1  Herstellung von elektronischen Bauelementen und Leiterplatten "]
[null,null,"26.2  Herstellung von Datenverarbeitungsgeräten und peripheren Geräten "]
[null,null,"26.3  Herstellung von Geräten und Einrichtungen der Telekommunikationstechnik "]
[null,null,"26.4  Herstellung von Geräten der Unterhaltungselektronik "]
[null,null,"26.5  Herstellung von Mess-, Kontroll-, Navigations- u.ä. Instrumenten und Vorrichtungen; Herstellung von "]
[null,null,"26.6  Herstellung von Bestrahlungs- und Elektrotherapiegeräten und elektromedizinischen Geräten "]
[null,null,"26.7  Herstellung von optischen und fotografischen Instrumenten und Geräten "]
[null,null,"26.8  Herstellung von magnetischen und optischen Datenträgern "]
[null,null,"27  HERSTELLUNG VON ELEKTRISCHEN AUSRÜSTUNGEN "]
[null,null,"27.1  Herstellung von Elektromotoren, Generatoren, Transformatoren, Elektrizitätsverteilungs- und  -schalteinrichtungen "]
[null,null,"27.2  Herstellung von Batterien und Akkumulatoren "]
[null,null,"27.3  Herstellung von Kabeln und elektrischem Installationsmaterial "]
[null,null,"27.4  Herstellung von elektrischen Lampen und Leuchten "]
[null,null,"27.5  Herstellung von Haushaltsgeräten "]
[null,null,"27.9  Herstellung von sonstigen elektrischen Ausrüstungen und Geräten a.n.g. "]
[null,null,"28  MASCHINENBAU "]
[null,null,"28.1  Herstellung von nicht wirtschaftszweigspezifischen Maschinen "]
[null,null,"28.2  Herstellung von sonstigen nicht wirtschaftszweigspezifischen Maschinen "]
[null,null,"28.3  Herstellung von land- und forstwirtschaftlichen Maschinen "]
[null,null,"28.4  Herstellung von Werkzeugmaschinen "]
[null,null,"28.9  Herstellung von Maschinen für sonstige bestimmte Wirtschaftszweige "]
[null,null,"29  HERSTELLUNG VON KRAFTWAGEN UND KRAFTWAGENTEILEN "]
[null,null,"29.1  Herstellung von Kraftwagen und Kraftwagenmotoren "]
[null,null,"29.2  Herstellung von Karosserien, Aufbauten und Anhängern "]
[null,null,"29.3  Herstellung von Teilen und Zubehör für Kraftwagen "]
[null,null,"30  SONSTIGER FAHRZEUGBAU "]
[null,null,"30.1  Schiff- und Bootsbau "]
[null,null,"30.2  Schienenfahrzeugbau "]
[null,null,"30.3  Luft- und Raumfahrzeugbau "]
[null,null,"30.4  Herstellung von militärischen Kampffahrzeugen "]
[null,null,"30.9  Herstellung von Fahrzeugen a.n.g. "]
[null,null,"31  HERSTELLUNG VON MÖBELN "]
[null,null,"31.0  Herstellung von Möbeln "]
[null,null,"32  HERSTELLUNG VON SONSTIGEN WAREN "]
[null,null,"32.1  Herstellung von Münzen, Schmuck und ähnlichen Erzeugnissen "]
[null,null,"32.2  Herstellung von Musikinstrumenten "]
[null,null,"32.3  Herstellung von Sportgeräten "]
[null,null,"32.4  Herstellung von Spielwaren "]
[null,null,"32.5  Herstellung von medizinischen und zahnmedizinischen Apparaten und Materialien "]
[null,null,"32.9  Herstellung von Erzeugnissen a.n.g. "]
[null,null,"33  REPARATUR UND INSTALLATION VON MASCHINEN UND AUSRÜSTUNGEN "]
[null,null,"33.1  Reparatur von Metallerzeugnissen, Maschinen und Ausrüstungen "]
[null,null,"33.2  Installation von Maschinen und Ausrüstungen a.n.g. "]
[]
["D","ENERGIEVERSORGUNG","35  ENERGIEVERSORGUNG "]
[null,null,"35.1  Elektrizitätsversorgung "]
[null,null,"35.2  Gasversorgung "]
[null,null,"35.3  Wärme- und Kälteversorgung "]
[]
["E","WASSERVERSORGUNG; ABWASSER- UND ABFALLENTSORGUNG UND BESEITIGUNG VON UMWELTVERSCHMUTZUNGEN","36  WASSERVERSORGUNG "]
[null,null,"36.0  Wasserversorgung "]
[null,null,"37  ABWASSERENTSORGUNG "]
[null,null,"37.0  Abwasserentsorgung "]
[null,null,"38  SAMMLUNG, BEHANDLUNG UND BESEITIGUNG VON ABFÄLLEN; RÜCKGEWINNUNG "]
[null,null,"38.1  Sammlung von Abfällen "]
[null,null,"38.2  Abfallbehandlung und -beseitigung "]
[null,null,"38.3  Rückgewinnung "]
[null,null,"39  BESEITIGUNG VON UMWELTVERSCHMUTZUNGEN UND SONSTIGE ENTSORGUNG "]
[null,null,"39.0  Beseitigung von Umweltverschmutzungen und sonstige Entsorgung "]
[]
["F","BAU","41  HOCHBAU "]
[null,null,"41.1  Erschließung von Grundstücken; Bauträger "]
[null,null,"41.2  Bau von Gebäuden "]
[null,null,"42  TIEFBAU "]
[null,null,"42.1  Bau von Straßen und Bahnverkehrsstrecken "]
[null,null,"42.2  Leitungstiefbau und Kläranlagenbau "]
[null,null,"42.9  Sonstiger Tiefbau "]
[null,null,"43  VORBEREITENDE BAUSTELLENARBEITEN, BAUINSTALLATION UND SONSTIGES AUSBAUGEWERBE "]
[null,null,"43.1  Abbrucharbeiten und vorbereitende Baustellenarbeiten "]
[null,null,"43.2  Bauinstallation "]
[null,null,"43.3  Sonstiger Ausbau "]
[null,null,"43.9  Sonstige spezialisierte Bautätigkeiten "]
[]
["G","HANDEL; INSTANDHALTUNG UND REPARATUR VON KRAFTFAHRZEUGEN","45  HANDEL MIT KRAFTFAHRZEUGEN; INSTANDHALTUNG UND REPARATUR VON KRAFTFAHRZEUGEN "]
[null,null,"45.1  Handel mit Kraftwagen "]
[null,null,"45.2  Instandhaltung und Reparatur von Kraftwagen "]
[null,null,"45.3  Handel mit Kraftwagenteilen und -zubehör "]
[null,null,"45.4  Handel mit Krafträdern, Kraftradteilen und -zubehör; Instandhaltung und Reparatur von Krafträdern "]
[null,null,"46  GROßHANDEL (OHNE HANDEL MIT KRAFTFAHRZEUGEN UND KRAFTRÄDERN) "]
[null,null,"46.1  Handelsvermittlung "]
[null,null,"46.2  Großhandel mit landwirtschaftlichen Grundstoffen und lebenden Tieren "]
[null,null,"46.3  Großhandel mit Nahrungs- und Genussmitteln, Getränken und Tabakwaren "]
[null,null,"46.4  Großhandel mit Gebrauchs- und Verbrauchsgütern "]
[null,null,"46.5  Großhandel mit Geräten der Informations- und Kommunikationstechnik "]
[null,null,"46.6  Großhandel mit sonstigen Maschinen, Ausrüstungen und Zubehör "]
[null,null,"46.7  Sonstiger Großhandel "]
[null,null,"46.9  Großhandel ohne ausgeprägten Schwerpunkt "]
[null,null,"47  EINZELHANDEL (OHNE HANDEL MIT KRAFTFAHRZEUGEN) "]
[null,null,"47.1  Einzelhandel mit Waren verschiedener Art (in Verkaufsräumen) "]
[null,null,"47.2  Einzelhandel mit Nahrungs- und Genussmitteln, Getränken und Tabakwaren (in Verkaufsräumen) "]
[null,null,"47.3  Einzelhandel mit Motorenkraftstoffen (Tankstellen) "]
[null,null,"47.4  Einzelhandel mit Geräten der Informations- und Kommunikationstechnik (in Verkaufsräumen) "]
[null,null,"47.5  Einzelhandel mit sonstigen Haushaltsgeräten, Textilien, Heimwerker- und Einrichtungsbedarf (in Verkaufsräumen) "]
[null,null,"47.6  Einzelhandel mit Verlagsprodukten, Sportausrüstungen und Spielwaren (in Verkaufsräumen) "]
[null,null,"47.7  Einzelhandel mit sonstigen Gütern (in Verkaufsräumen) "]
[null,null,"47.8  Einzelhandel an Verkaufsständen und auf Märkten "]
[null,null,"47.9  Einzelhandel, nicht in Verkaufsräumen, an Verkaufsständen oder auf Märkten "]
[]
["H","VERKEHR UND LAGEREI","49  LANDVERKEHR UND TRANSPORT IN ROHRFERNLEITUNGEN "]
[null,null,"49.1  Personenbeförderung im Eisenbahnfernverkehr "]
[null,null,"49.2  Güterbeförderung im Eisenbahnverkehr "]
[null,null,"49.3  Sonstige Personenbeförderung im Landverkehr "]
[null,null,"49.4  Güterbeförderung im Straßenverkehr, Umzugstransporte "]
[null,null,"49.5  Transport in Rohrfernleitungen "]
[null,null,"50  SCHIFFFAHRT "]
[null,null,"50.1  Personenbeförderung in der See- und Küstenschifffahrt "]
[null,null,"50.2  Güterbeförderung in der See- und Küstenschifffahrt "]
[null,null,"50.3  Personenbeförderung in der Binnenschifffahrt "]
[null,null,"50.4  Güterbeförderung in der Binnenschifffahrt "]
[null,null,"51  LUFTFAHRT "]
[null,null,"51.1  Personenbeförderung in der Luftfahrt "]
[null,null,"51.2  Güterbeförderung in der Luftfahrt und Raumtransport "]
[null,null,"52  LAGEREI SOWIE ERBRINGUNG VON SONSTIGEN DIENSTLEISTUNGEN FÜR DEN VERKEHR "]
[null,null,"52.1  Lagerei "]
[null,null,"52.2  Erbringung von sonstigen Dienstleistungen für den Verkehr "]
[null,null,"53  POST-, KURIER- UND EXPRESSDIENSTE "]
[null,null,"53.1  Postdienste von Universaldienstleistungsanbietern "]
[null,null,"53.2  Sonstige Post-, Kurier- und Expressdienste "]
[]
["I","BEHERBERGUNG UND GASTRONOMIE","55  BEHERBERGUNG "]
[null,null,"55.1  Hotels, Gasthöfe und Pensionen "]
[null,null,"55.2  Ferienunterkünfte und ähnliche Beherbergungsstätten "]
[null,null,"55.3  Campingplätze "]
[null,null,"55.9  Sonstige Beherbergungsstätten "]
[null,null,"56  GASTRONOMIE "]
[null,null,"56.1  Restaurants, Gaststätten, Imbissstuben, Cafés, Eissalons u. Ä. "]
[null,null,"56.2  Caterer und Erbringung sonstiger Verpflegungsdienstleistungen "]
[null,null,"56.3  Ausschank von Getränken "]
[]
["J","INFORMATION UND KOMMUNIKATION","58  VERLAGSWESEN "]
[null,null,"58.1  Verlegen von Büchern und Zeitschriften; sonstiges Verlagswesen (ohne Software) "]
[null,null,"58.2  Verlegen von Software "]
[null,null,"59  HERSTELLUNG, VERLEIH UND VERTRIEB VON FILMEN UND FERNSEHPROGRAMMEN; KINOS; TONSTUDIOS UND VERLEGEN VON MUSIK "]
[null,null,"59.1  Herstellung von Filmen und Fernsehprogrammen, deren Verleih und Vertrieb, Kinos "]
[null,null,"59.2  Tonstudios; Herstellung von Hörfunkbeiträgen; Verlegen von bespielten Tonträgern und Musikalien "]
[null,null,"60  RUNDFUNKVERANSTALTER "]
[null,null,"60.1  Hörfunkveranstalter "]
[null,null,"60.2  Fernsehveranstalter "]
[null,null,"61  TELEKOMMUNIKATION "]
[null,null,"61.1  Leitungsgebundene Telekommunikation "]
[null,null,"61.2  Drahtlose Telekommunikation "]
[null,null,"61.3  Satellitentelekommunikation "]
[null,null,"61.9  Sonstige Telekommunikation "]
[null,null,"62  ERBRINGUNG VON DIENSTLEISTUNGEN DER INFORMATIONSTECHNOLOGIE "]
[null,null,"62.0  Erbringung von Dienstleistungen der Informationstechnologie "]
[null,null,"62.01  Programmierungstätigkeiten "]
[null,null,"62.02  Erbringung von Beratungsleistungen auf dem Gebiet der Informationstechnologie "]
[null,null,"62.03  Betrieb von Datenverarbeitungseinrichtungen für Dritte "]
[null,null,"62.09  Erbringung von sonstigen Dienstleistungen der Informationstechnologie "]
[null,null,"63  INFORMATIONSDIENSTLEISTUNGEN "]
[null,null,"63.1  Datenverarbeitung, Hosting und damit verbundene Tätigkeiten; Webportale "]
[null,null,"63.9  Erbringung von sonstigen Informationsdienstleistungen "]
[]
["K","ERBRINGUNG VON FINANZ- UND VERSICHERUNGSDIENSTLEISTUNGEN","64  ERBRINGUNG VON FINANZDIENSTLEISTUNGEN "]
[null,null,"64.1  Zentralbanken und Kreditinstitute "]
[null,null,"64.2  Beteiligungsgesellschaften "]
[null,null,"64.3  Treuhand- und sonstige Fonds und ähnliche Finanzinstitutionen "]
[null,null,"64.9  Sonstige Finanzierungsinstitutionen "]
[null,null,"65  VERSICHERUNGEN, RÜCKVERSICHERUNGEN UND PENSIONSKASSEN (OHNE SOZIALVERSICHERUNG) "]
[null,null,"65.1  Versicherungen "]
[null,null,"65.2  Rückversicherungen "]
[null,null,"65.3  Pensionskassen und Pensionsfonds "]
[null,null,"66  MIT FINANZ- UND VERSICHERUNGSDIENSTLEISTUNGEN VERBUNDENE TÄTIGKEITEN "]
[null,null,"66.1  Mit Finanzdienstleistungen verbundene Tätigkeiten "]
[null,null,"66.2  Mit Versicherungsdienstleistungen und Pensionskassen verbundene Tätigkeiten "]
[null,null,"66.3  Fondsmanagement "]
[]
["L","GRUNDSTÜCKS- UND WOHNUNGSWESEN","68  GRUNDSTÜCKS- UND WOHNUNGSWESEN "]
[null,null,"68.1  Kauf und Verkauf von eigenen Grundstücken, Gebäuden und Wohnungen "]
[null,null,"68.2  Vermietung, Verpachtung von eigenen oder geleasten Grundstücken, Gebäuden und Wohnungen "]
[null,null,"68.3  Vermittlung und Verwaltung von Grundstücken, Gebäuden und Wohnungen für Dritte "]
[]
["M","ERBRINGUNG VON FREIBERUFLICHEN, WISSENSCHAFTLICHEN UND TECHNISCHEN DIENSTLEISTUNGEN","69  RECHTS- UND STEUERBERATUNG, WIRTSCHAFTSPRÜFUNG "]
[null,null,"69.1  Rechtsberatung "]
[null,null,"69.2  Wirtschaftsprüfung und Steuerberatung; Buchführung "]
[null,null,"70  VERWALTUNG UND FÜHRUNG VON UNTERNEHMEN UND BETRIEBEN; UNTERNEHMENSBERATUNG "]
[null,null,"70.1  Verwaltung und Führung von Unternehmen und Betrieben "]
[null,null,"70.2  Public-Relations- und Unternehmensberatung "]
[null,null,"71  ARCHITEKTUR- UND INGENIEURBÜROS; TECHNISCHE, PHYSIKALISCHE UND CHEMISCHE UNTERSUCHUNG "]
[null,null,"71.1  Architektur- und Ingenieurbüros "]
[null,null,"71.2  Technische, physikalische und chemische Untersuchung "]
[null,null,"72  FORSCHUNG UND ENTWICKLUNG "]
[null,null,"72.1  Forschung und Entwicklung im Bereich Natur-, Ingenieur-, Agrarwissenschaften und Medizin "]
[null,null,"72.2  Forschung und Entwicklung im Bereich Rechts-, Wirtschafts- und Sozialwissenschaften sowie im Bereich Sprach-, Kultur- und Kunstwissenschaften "]
[null,null,"73  WERBUNG UND MARKTFORSCHUNG "]
[null,null,"73.1  Werbung "]
[null,null,"73.2  Markt- und Meinungsforschung "]
[null,null,"74  SONSTIGE FREIBERUFLICHE, WISSENSCHAFTLICHE UND TECHNISCHE TÄTIGKEITEN "]
[null,null,"74.1  Ateliers für Textil-, Schmuck-, Grafik- u.ä. Design "]
[null,null,"74.2  Fotografie und Fotolabors "]
[null,null,"74.3  Übersetzen und Dolmetschen "]
[null,null,"74.9  Sonstige freiberufliche, wissenschaftliche und technische Tätigkeiten a.n.g. "]
[null,null,"75  VETERINÄRWESEN "]
[null,null,"75.0  Veterinärwesen "]
[null,null," "]
["N","ERBRINGUNG VON SONSTIGEN WIRTSCHAFTLICHEN DIENSTLEISTUNGEN","77  VERMIETUNG VON BEWEGLICHEN SACHEN "]
[null,null,"77.1  Vermietung von Kraftwagen "]
[null,null,"77.2  Vermietung von Gebrauchsgütern "]
[null,null,"77.3  Vermietung von Maschinen, Geräten und sonstigen beweglichen Sachen "]
[null,null,"77.4  Leasing von nichtfinanziellen immateriellen Vermögensgegenständen (ohne Copyrights) "]
[null,null,"78  VERMITTLUNG UND ÜBERLASSUNG VON ARBEITSKRÄFTEN "]
[null,null,"78.1  Vermittlung von Arbeitskräften "]
[null,null,"78.2  Befristete Überlassung von Arbeitskräften "]
[null,null,"78.3  Sonstige Überlassung von Arbeitskräften "]
[null,null,"79  REISEBÜROS, REISEVERANSTALTER UND ERBRINGUNG SONSTIGER RESERVIERUNGSDIENSTLEISTUNGEN "]
[null,null,"79.1  Reisebüros und Reiseveranstalter "]
[null,null,"79.9  Erbringung sonstiger Reservierungsdienstleistungen "]
[null,null,"80  WACH- UND SICHERHEITSDIENSTE SOWIE DETEKTEIEN "]
[null,null,"80.1  Private Wach- und Sicherheitsdienste "]
[null,null,"80.10  Private Wach- und Sicherheitsdienste "]
[null,null,"80.10-0  Private Wach- und Sicherheitsdienste "]
[null,null,"80.2  Sicherheitsdienste mithilfe von Überwachungs- und Alarmsystemen "]
[null,null,"80.3  Detekteien "]
[null,null,"81  GEBÄUDEBETREUUNG; GARTEN- UND LANDSCHAFTSBAU "]
[null,null,"81.1  Hausmeisterdienste "]
[null,null,"81.2  Reinigung von Gebäuden, Straßen und Verkehrsmitteln "]
[null,null,"81.3  Garten- und Landschaftsbau sowie Erbringung von sonstigen gärtnerischen Dienstleistungen "]
[null,null,"82  ERBRINGUNG VON WIRTSCHAFTLICHEN DIENSTLEISTUNGEN FÜR UNTERNEHMEN UND PRIVATPERSONEN A.N.G. "]
[null,null,"82.1  Sekretariats- und Schreibdienste, Copy-Shops "]
[null,null,"82.2  Call Centers "]
[null,null,"82.3  Messe-, Ausstellungs- und Kongressveranstalter "]
[null,null,"82.9  Erbringung sonstiger wirtschaftlicher Dienstleistungen für Unternehmen und Privatpersonen "]
[]
["S","ERBRINGUNG VON SONSTIGEN DIENSTLEISTUNGEN","94  INTERESSENVERTRETUNGEN SOWIE KIRCHLICHE UND SONSTIGE RELIGIÖSE VEREINIGUNGEN (OHNE SOZIALWESEN UND SPORT) "]
[null,null,"94.1  Wirtschafts- und Arbeitgeberverbände, Berufsorganisationen "]
[null,null,"94.2  Arbeitnehmervereinigungen "]
[null,null,"94.9  Kirchliche Vereinigungen; politische Parteien sowie sonstige Interessenvertretungen und  Vereinigungen a.n.g. "]
[null,null,"95  REPARATUR VON DATENVERARBEITUNGSGERÄTEN UND GEBRAUCHSGÜTERN "]
[null,null,"95.1  Reparatur von Datenverarbeitungs- und Telekommunikationsgeräten "]
[null,null,"95.2  Reparatur von Gebrauchsgütern "]
[null,null,"96  ERBRINGUNG VON SONSTIGEN ÜBERWIEGEND PERSÖNLICHEN DIENSTLEISTUNGEN "]
[null,null,"96.0  Erbringung von sonstigen überwiegend persönlichen Dienstleistungen "]
[null,null," "]
[null,null,"a.n.g. :             anderweitig nicht genannt"]

{"sheet":"Daten für Bruttowertschöpfung","index":37,"n_rows":21,"n_cols":12,"rows_kept":21,"cut":false,"hidden":true,"merged":[]}
["ÖNACE Gruppen","Branche","Burgenland","Kärnten","Niederösterreich","Oberösterreich","Salzburg","Steiermark","Tirol","Vorarlberg","Wien","Österreich"]
[null,"Bergbau und Gewinnung von Steinen u. Erden (B)",266.85094185094181,603.35370511841086,1746.437877968435,415.06060606060606,386.61808928984505,383.31299572910308,360.94578067672239,424.12776412776412,2453.5967472894076,969.17194685360778]
[null,"Herstellung von Waren  (C)",292.83637341022103,332.58220000447454,336.28245157508326,359.26565026901346,379.37868270190938,354.99806857045951,345.20211628864269,377.82820930947344,389.87411802948509,356.46756353921086]
[null,"Energieversorgung (D)",688.90165189804179,882.86542876706812,874.35646195236995,562.22910608167911,642.72334036392226,636.05382180009053,943.52587005425437,884.70938077864957,1107.3959668959085,853.90020566820317]
[null,"Wasserversorgung; Abwasser- u. Abfallentsorgung u. Beseitigung v. Umweltverschmutzungen (E)",402.99682875264273,492.43726664930102,415.19852747830657,361.21447093477008,390.21458870498208,338.02808573540278,328.104134565999,581.25963020030815,593.96990822242572,430.46382950929808]
[null,"Bau (F)",182.25004183789213,261.86747987391072,211.53864345851858,247.36274694768613,246.58466696787389,223.04097823713516,225.2246850126709,242.39741340762907,268.34326104630901,238.83427539094859]
[null,"Handel; Instandhaltung und Reparatur von KFZ (G)",181.15976776611362,189.4228095621003,188.69628295404914,213.94231530950816,218.66520224974911,173.08025163200574,197.11173579929704,225.53234390949839,295.50551462709751,220.19691299490648]
[null,"Verkehr und Lagerei (H)",171.47597557738254,218.24579524257325,273.48127444856698,216.27342123525332,252.07300118279346,210.74149168028836,309.42825617119922,257.54242283885634,402.9298310066128,314.00186940904985]
[null,"Beherbergung und Gastronomie (I)",115.45311277400016,119.17820896443223,105.34799681311176,112.61550191421712,153.77788115466544,108.33595705065223,166.55974151103155,160.41774346560243,115.62790388955264,128.36299497159172]
[null,"Information und Kommunikation (J)",253.70792702107582,251.99327135260285,252.26248247600563,304.10082032076343,347.58325832583262,239.75374618906926,266.51927838698271,277.93301435406698,430.93260175324571,368.85994013392354]
[null,"Erbringung von Finanz- und Versicherungsdienstl. (K)",478.08977143448135,472.55841317868544,417.55210331159697,578.02575914261547,404.91590254126282,490.92624665054575,499.58490775727938,596.22897964344429,853.84213253102291,661.84342437594773]
[null,"Grundstücks- und Wohnungswesen (L)",649.63488677387591,594.80759881829397,724.68352324710963,733.98490683471425,690.843949044586,601.03620700042165,712.27474150664693,665.93120674402871,1012.6175162044074,803.99110828599839]
[null,"Erbringung v. freiberuflichen, wissenschaftl. und techn.Dienstl. (M)",201.74406551259457,228.45092718227045,237.23853907012031,274.81195373757356,229.76359901343966,242.97186262518619,232.98765831432539,258.90956656162672,285.89847244484008,260.38645491055127]
[null,"Erbringung von sonstigen wirtschaftl. Dienstleistungen (N)",200.80026852277143,184.23296917272822,194.88353610075197,205.94684316594427,207.7497150185238,164.56667653736056,172.48278365837331,153.34734686981324,251.2947011583685,212.93709111595714]
[null,"Reparatur von Gebrauchsgütern (S95)",100.14430014430015,133.35158817086528,139.03532365070825,124.57412717152977,117.67919580419581,138.13131313131314,133.27382587201316,136.47017045454547,152.13588397945941,139.61964780548851]
[]
["Q: Sonderauswertung Leistungs- und Strukturstatistik 2012, Statistik Austria. Daten bearbeitet von DonauConsult Ingenieurbüro GmbH"]
[]
["*): Gruppierung lt. \"SYSTEMATIK DER WIRTSCHAFTSTÄTIGKEITEN ÖNACE 2008\", Band 1; Statistik Austria, Wien, 2008"]
[]
[null,"Erwerbstätige umfassen Arbeitnehmer und Arbeitnehmerinnen sowie Selbständige. "]

{"sheet":"Faktoren","index":38,"n_rows":101,"n_cols":15,"rows_kept":101,"cut":false,"hidden":true,"merged":[]}
["Jahre","DFAKE","DFAKR","AFAKE","AFAKR",null,"Zinssatz i",3.5000000000000003E-2,"Jahre","DFAKE","DFAKR","AFAKE","AFAKR","Zinssatz i",1E-3]
[1,{"$f":"1/(1+$H$1)^A2","v":0.96618357487922713},{"$f":"((1+$H$1)^A2-1)/($H$1*(1+$H$1)^A2)","v":0.96618357487922479},{"$f":"(1+$H$1)^A2","v":1.0349999999999999},{"$f":"((1+$H$1)^A2-1)/$H$1","v":0.99999999999999767},null,null,null,1,{"$f":"1/(1+$O$1)^I2","v":0.99900099900099915},{"$f":"((1+$O$1)^I2-1)/($O$1*(1+$O$1)^I2)","v":0.99900099900088901},{"$f":"(1+$O$1)^I2","v":1.0009999999999999},{"$f":"((1+$O$1)^I2-1)/$O$1","v":0.99999999999988987}]
[2,0.93351070036640305,1.8996942752456265,1.0712249999999999,2.0349999999999961,null,null,null,2,{"$f":"1/(1+$O$1)^I3","v":0.99800299600499431},{"$f":"((1+$O$1)^I3-1)/($O$1*(1+$O$1)^I3)","v":1.9970039950056915},{"$f":"(1+$O$1)^I3","v":1.0020009999999997},{"$f":"((1+$O$1)^I3-1)/$O$1","v":2.0009999999996975}]
[3,0.90194270566802237,2.8016369809136461,1.1087178749999997,3.1062249999999922,null,null,null,3,0.99700599001497947,2.9940099850204804,1.0030030009999995,3.0030009999995055]
[4,0.87144222769857238,3.6730792086122173,1.1475230006249997,4.2149428749999904,null,null,null,4,0.99600998003494456,3.9900199650554056,1.0040060040009995,4.0060040009994857]
[5,0.84197316685852419,4.5150523754707379,1.1876863056468745,5.3624658756249852,null,null,null,5,0.99501496506987486,4.9850349301251402,1.0050100100050003,5.0100100050003427]
[6,0.81350064430775282,5.3285530197784921,1.2292553263445152,6.5501521812718613,null,null,null,6,0.99402094412574937,5.9790558742506388,1.0060150200150051,6.0150200150050903]
[7,0.78599096068381913,6.114543980462309,1.2722792627665731,7.7794075076163738,null,null,null,7,0.99302791620954001,6.9720837904600259,1.0070210350350199,7.0210350350199402]
[8,0.75941155621625056,6.8739555366785545,1.3168090369634029,9.0516867703829398,null,null,null,8,0.99203588032921075,7.964119670789243,1.008028056070055,8.0280560700549675]
[9,0.73373097218961414,7.6076865088681656,1.3628973532571218,10.368495807346337,null,null,null,9,0.99104483549371702,8.955164506282939,1.009036084126125,9.0360841261249991]
[10,0.70891881370977217,8.3166053225779368,1.410598760621121,11.731393160603456,null,null,null,10,0.99005478071300423,9.9452192869957674,1.0100451202102509,10.045120210250946]
[11,0.68494571372924851,9.0015510363071858,1.4599697172428603,13.141991921224578,null,null,null,11,0.98906571499800655,10.934285001993496,1.0110551653304609,11.055165330460914]
[12,0.66178329828912896,9.6633343345963141,1.5110686573463603,14.601961638467436,null,null,null,12,0.98807763736064591,11.922362639354082,1.0120662204957913,12.066220495791313]
[13,0.63940415293635666,10.302738487532665,1.5639560603534826,16.113030295813786,null,null,null,13,0.98709054681383213,12.909453186167889,1.0130782867162871,13.07828671628708]
[14,0.61778179027667302,10.920520277809342,1.6186945224658547,17.676986356167273,null,null,null,14,0.986104442371461,13.895557628539002,1.014091365003003,14.091365003003009]
[15,0.59689061862480497,11.517410896434145,1.6753488307521593,19.295680878633121,null,null,null,15,0.98511932304841265,14.880676951587381,1.015105456368006,15.105456368005976]
[16,0.57670591171478747,12.094116808148929,1.7339860398284845,20.97102970938527,null,null,null,16,0.98413518786055221,15.86481213944778,1.0161205618243738,16.120561824373823]
[17,0.55720377943457733,12.651320587583506,1.7946755512224815,22.705015749213754,null,null,null,17,0.98315203582472765,16.847964175272349,1.017136682386198,17.136682386198032]
[18,0.53836113955031628,13.18968172713382,1.8574891955152681,24.499691300436229,null,null,null,18,0.98216986595876898,17.830134041231041,1.0181538190685842,18.153819068584152]
[19,0.52015569038677911,13.709837417520596,1.9225013173583023,26.357180495951493,null,null,null,19,0.98118867728148773,18.81132271851229,1.0191719728876525,19.171972887652487]
[20,0.50256588443167061,14.212403301952268,1.9897888634658427,28.279681813309789,null,null,null,20,0.98020846881267509,19.791531187324903,1.0201911448605401,20.191144860540078]
[21,0.48557090283253213,14.697974204784796,2.0594314736871469,30.269470676775622,null,null,null,21,0.97922923957310215,20.770760426897876,1.0212113360054005,21.211336005400483]
[22,0.46915063075606966,15.167124835540866,2.1315115752661971,32.328902150462767,null,null,null,22,0.97825098858451787,21.749011415482087,1.0222325473414056,22.23254734140556]
[23,0.45328563358074364,15.620410469121609,2.2061144804005139,34.460413725728969,null,null,null,23,0.97727371486964842,22.726285130351577,1.0232547798887468,23.2547798887468]
[24,0.43795713389443841,16.058367603016045,2.2833284872145314,36.666528206129463,null,null,null,24,0.976297417452196,23.702582547803974,1.0242780346686358,24.278034668635762]
[25,0.42314698926998884,16.481514592286032,2.3632449842670398,38.949856693343989,null,null,null,25,0.97532209535683934,24.677904643160719,1.0253023127033043,25.302312703304295]
[26,0.40883767079225974,16.890352263078292,2.4459585587163861,41.31310167761103,null,null,null,26,0.97434774760923015,25.652252390769803,1.0263276150160074,26.327615016007442]
[27,0.39501224231136206,17.285364505389651,2.5315671082714597,43.759060236327414,null,null,null,27,0.97337437323599441,26.625626764005553,1.0273539426310232,27.353942631023198]
[28,0.38165434039745127,17.667018845787105,2.6201719570609607,46.290627344598875,null,null,null,28,0.97240197126472983,27.598028735270137,1.0283812965736541,28.381296573654069]
[29,0.36874815497338298,18.035767000760483,2.7118779755580937,48.910799301659814,null,null,null,29,0.97143054072400581,28.569459275994166,1.0294096778702277,29.409677870227746]
[30,0.35627841060230236,18.392045411362787,2.8067937047026272,51.622677277217917,null,null,null,30,0.97046008064336287,29.539919356637121,1.0304390875480975,30.439087548097543]
[31,0.34423034840802164,18.736275759770809,2.9050314843672189,54.429470981920538,null,null,null,31,0.96949059005330951,30.509409946690514,1.0314695266356457,31.469526635645728]
[32,0.33258970860678427,19.068865468377588,3.0067075863200707,57.334502466287731,null,null,null,32,0.96852206798532448,31.477932014675563,1.0325009961622811,32.500996162281083]
[33,0.32134271362974326,19.390208182007335,3.111942351841273,60.341210052607792,null,null,null,33,0.96755451347185262,32.445486528147391,1.0335334971584433,33.533497158443339]
[34,0.3104760518161771,19.700684233823509,3.2208603341557174,63.453152404449064,null,null,null,34,0.96658792554630668,33.41207445369335,1.0345670306556014,34.567030655601407]
[35,0.29997686165814214,20.00066109548165,3.3335904458511671,66.674012738604773,null,null,null,35,0.96562230324306364,34.377696756936338,1.0356015976862569,35.601597686256923]
[36,0.28983271657791515,20.290493812059566,3.4502661114559579,70.007603184455931,null,null,null,36,0.96465764559746625,35.342354402533779,1.0366371992839432,36.637199283943154]
[37,0.28003161022020789,20.570525422279772,3.571025425356916,73.457869295911877,null,null,null,37,0.9636939516458205,36.306048354179488,1.037673836483227,37.673836483226971]
[38,0.27056194224174673,20.841087364521517,3.6960113152444083,77.028894721268799,null,null,null,38,0.96273122042539527,37.268779574604679,1.03871151031971,38.711510319709987]
[39,0.26141250458139786,21.102499869102918,3.8253717112779619,80.72490603651319,null,null,null,39,0.96176945097442113,38.230549025578831,1.0397502218300294,39.75022183002941]
[40,0.25257246819458734,21.3550723372975,3.9592597211726899,84.550277747791128,null,null,null,40,0.96080864233208907,39.1913576679109,1.0407899720518594,40.789972051859415]
[41,0.24403137023631633,21.599103707533814,4.0978338114137332,88.509537468963799,null,null,null,41,0.95984879353855046,40.151206461449512,1.0418307620239113,41.83076202391134]
[42,0.2357791016776003,21.834882809211418,4.2412579948132141,92.607371280377535,null,null,null,42,0.95888990363491577,41.110096365084225,1.042872592785935,42.872592785935026]
[43,0.22780589534067661,22.062688704552098,4.3897020246316769,96.84862927519076,null,null,null,43,0.95793197166325283,42.06802833674714,1.0439154653787206,43.915465378720597]
[44,0.22010231433881802,22.282791018890912,4.5433415954937848,101.23833129982242,null,null,null,44,0.95697499666658625,43.02500333341375,1.0449593808440993,44.959380844099336]
[45,0.21265924090707056,22.49545025979798,4.7023585513360668,105.78167289531619,null,null,null,45,0.95601897768889732,43.981022311102684,1.0460043402249435,46.004340224943483]
[46,0.20546786561069619,22.700918125408677,4.8669411006328298,110.48403144665227,null,null,null,46,0.95506391377512256,44.936086224877407,1.047050344565168,47.05034456516799]
[47,0.19851967691854708,22.899437802327224,5.0372840391549776,115.35097254728507,null,null,null,47,0.95410980397115142,45.890196028848592,1.0480973949097332,48.09739490973319]
[48,0.19180645112903102,23.091244253456257,5.213588980525401,120.38825658644002,null,null,null,48,0.95315664732382788,46.843352676172124,1.0491454923046426,49.145492304642602]
[49,0.18532024263674499,23.276564496092998,5.3960645948437893,125.60184556696539,null,null,null,49,0.95220444288094708,47.795557119052944,1.0501946377969471,50.194637796947106]
[50,0.17905337452825601,23.455617870621253,5.5849268556633218,130.99791016180919,null,null,null,50,0.95125318969125572,48.74681030874423,1.0512448324347441,51.24483243474409]
[51,0.17299842949589955,23.628616300117152,5.7803992956115371,136.58283701747249,null,null,null,51,0.95030288680445152,49.697113195548432,1.0522960772671786,52.296077267178553]
[52,0.16714824105884016,23.795764541175991,5.9827132709579409,142.363236313084,null,null,null,52,0.94935353327118055,50.646466728819433,1.0533483733444455,53.348373344445534]
[53,0.16149588508100501,23.957260426256997,6.1921082354414674,148.3459495840419,null,null,null,53,0.94840512814303757,51.594871856962399,1.0544017217177899,54.401721717789897]
[54,0.15603467157585027,24.113295097832847,6.408832023681919,154.53805781948338,null,null,null,54,0.94745767047256524,52.542329527434752,1.0554561234395075,55.456123439507451]
[55,0.15075813678826111,24.264053234621109,6.6331411445107866,160.94688984316531,null,null,null,55,0.94651115931325225,53.488840686747793,1.0565115795629467,56.511579562946721]
[56,0.14566003554421367,24.409713270165323,6.8653010845686619,167.58003098767605,null,null,null,56,0.94556559371953253,54.434406280467464,1.0575680911425098,57.568091142509822]
[57,0.14073433385914366,24.550447604024463,7.1055866225285644,174.44533207224467,null,null,null,57,0.9446209727467858,55.379027253214176,1.0586256592336523,58.625659233652257]
[58,0.13597520179627406,24.68642280582074,7.3542821543170644,181.55091869477326,null,null,null,58,0.94367729545133461,56.322704548665421,1.0596842848928858,59.684284892885799]
[59,0.13137700656644835,24.817799812387186,7.6116820297181622,188.90520084909033,null,null,null,59,0.94273456089044438,57.265439109555672,1.0607439691777785,60.743969177778467]
[60,0.12693430586130278,24.944734118248491,7.8780909007582975,196.51688287880847,null,null,null,60,0.94179276812232215,58.207231877677884,1.0618047131469561,61.804713146956125]
[61,0.12264184141188678,25.067375959660374,8.1538240822848351,204.3949737795667,null,null,null,61,0.94085191620611597,59.148083793884027,1.0628665178601031,62.866517860103109]
[62,0.11849453276510799,25.185870492425483,8.4392079251648049,212.54879786185154,null,null,null,62,0.93991200420191456,60.08799579808548,1.0639293843779627,63.929384377962691]
[63,0.11448747127063574,25.300357963696118,8.7345802025455725,220.98800578701633,null,null,null,63,0.93897303117074382,61.026968829256198,1.0649933137623406,64.993313762340634]
[64,0.11061591427114567,25.410973877967265,9.0402905096346657,229.72258598956185,null,null,null,64,0.93803499617456942,61.965003825430543,1.0660583070761027,66.058307076102722]
[65,{"$f":"1/(1+$H$1)^A66","v":0.10687527948902965},{"$f":"((1+$H$1)^A66-1)/($H$1*(1+$H$1)^A66)","v":25.517849157456293},{"$f":"(1+$H$1)^A66","v":9.3567006774718777},{"$f":"((1+$H$1)^A66-1)/$H$1","v":238.76287649919649},null,null,null,65,0.9370978982762932,62.902101723706807,1.0671243653831788,67.124365383178784]
[66,0.10326113960292721,25.621110297059218,9.6841852011833929,248.11957717666834,null,null,null,66,{"$f":"1/(1+$O$1)^I67","v":0.93616173653975376},{"$f":"((1+$O$1)^I67-1)/($O$1*(1+$O$1)^I67)","v":63.838263460246239},{"$f":"(1+$O$1)^I67","v":1.0681914897485616},{"$f":"((1+$O$1)^I67-1)/$O$1","v":68.191489748561594}]
[67,9.9769217007659144E-2,25.72087951406688,10.023131683224811,257.80376237785174,null,null,null,67,0.93522651002972423,64.773489970275776,1.0692596812383099,69.259681238309938]
[68,9.6395378751361491E-2,25.817274892818244,10.37394129213768,267.82689406107653,null,null,null,68,0.9342922178119123,65.707782188087663,1.0703289409195482,70.328940919548216]
[69,9.3135631643827543E-2,25.910410524462069,10.737029237362496,278.20083535321413,null,null,null,69,0.93335885895295945,66.641141047040591,1.0713992698604677,71.39926986046774]
[70,8.9986117530268139E-2,26.000396641992335,11.112825260670185,288.93786459057668,null,null,null,70,0.93242643252043933,67.573567479560722,1.0724706691303278,72.470669130327849]
[71,8.6943108724896773E-2,26.087339750717234,11.501774144793639,300.05068985124683,null,null,null,71,0.9314949375828564,68.505062417143549,1.0735431397994581,73.543139799458146]
[72,8.400300359893409E-2,26.171342754316168,11.904336239861415,311.55246399604039,null,null,null,72,0.9305643732096468,69.435626790353197,1.0746166829392576,74.616682939257601]
[73,8.1162322317810731E-2,26.252505076633977,12.320988008256563,323.45680023590177,null,null,null,73,0.92963473847117573,70.365261528824306,1.0756912996221968,75.69129962219678]
[74,7.841770272252245E-2,26.330922779356499,12.752222588545541,335.77778824415827,null,null,null,74,0.92870603243873717,71.293967561262804,1.0767669909218187,76.766990921818717]
[75,7.5765896350263234E-2,26.406688675706764,13.198550379144637,348.53001083270385,null,null,null,75,0.92777825418455284,72.221745815447107,1.0778437579127402,77.84375791274023]
[76,7.3203764589626324E-2,26.479892440296389,13.660499642414697,361.72856121184844,null,null,null,76,0.92685140278177125,73.148597218228801,1.0789216016706529,78.921601670652876]
[77,7.0728274965822541E-2,26.550620715262209,14.13861712989921,375.38906085426311,null,null,null,77,0.92592547730446673,74.074522695533275,1.0800005232723235,80.000523272323548]
[78,6.8336497551519354E-2,26.618957212813733,14.633468729445683,389.52767798416232,null,null,null,78,0.92500047682763931,74.999523172360696,1.0810805237955956,81.08052379559561]
[79,6.6025601499052525E-2,26.684982814312786,15.145640134976279,404.16114671360793,null,null,null,79,0.92407640042721217,75.923599572787836,1.0821616043193911,82.161604319391117]
[80,6.3792851689905838E-2,26.74877566600269,15.675737539700446,419.30678684858412,null,null,null,80,0.92315324718003222,76.846752819967776,1.0832437659237104,83.243765923710413]
[81,6.1635605497493563E-2,26.810411271500183,16.224388353589962,434.98252438828456,null,null,null,81,0.9222310161638686,77.768983836131383,1.0843270096896338,84.327009689633798]
[82,5.9551309659414069E-2,26.869962581159594,16.79224194596561,451.20691274187453,null,null,null,82,0.92130970645741117,78.69029354258879,1.0854113366993234,85.411336699323442]
[83,5.7537497255472546E-2,26.927500078415068,17.379970414074403,467.99915468784008,null,null,null,83,0.92038931714027128,79.610682859728726,1.0864967480360224,86.496748036022368]
[84,5.5591784787896191E-2,26.983091863202965,17.988269378567004,485.37912510191438,null,null,null,84,0.91946984729297832,80.530152707021657,1.0875832447840583,87.583244784058323]
[85,5.3711869360286178E-2,27.03680373256325,18.617858806816848,503.36739448048132,null,null,null,85,0.91855129599698138,81.448704003018648,1.0886708280288424,88.670828028842408]
[86,5.1895525951967315E-2,27.08869925851522,19.269483865055438,521.98525328729818,null,null,null,86,0.91763366233464705,82.366337665352958,1.0897594988568708,89.759498856870849]
[87,5.014060478450949E-2,27.138839863299729,19.943915800332377,541.25473715235353,null,null,null,87,0.91671694538925796,83.283054610741971,1.0908492583557274,90.849258355727429]
[88,4.8445028777303868E-2,27.187284892077031,20.641952853344005,561.19865295268585,null,null,null,88,0.91580114424501269,84.198855754987306,1.0919401076140836,91.940107614083558]
[89,4.6806791089182481E-2,27.234091683166209,21.364421203211045,581.84060580602977,null,null,null,89,0.91488625798702583,85.113742012974214,1.0930320477216975,93.032047721697481]
[90,4.5223952743171487E-2,27.279315635909384,22.112175945323429,603.20502700924078,null,null,null,90,0.91397228570132449,86.027714298675448,1.0941250797694191,94.125079769419088]
[91,4.3694640331566649E-2,27.32301027624095,22.886102103409751,625.31720295456421,null,null,null,91,0.91305922647484994,86.940773525150064,1.0952192048491882,95.219204849188216]
[92,4.2217043798615121E-2,27.365227320039565,23.687115677029091,648.20330505797392,null,null,null,92,0.91214707939545459,87.852920604545375,1.0963144240540372,96.314424054037232]
[93,4.0789414298178867E-2,27.406016734337744,24.516164725725105,671.89042073500298,null,null,null,93,0.91123584355190268,88.764156448097339,1.0974107384780913,97.410738478091332]
[94,3.9410062123844319E-2,27.445426796461589,25.374230491125484,696.40658546072802,null,null,null,94,0.91032551803386919,89.674481966130784,1.0985081492165689,98.50814921656891]
[95,3.807735470902833E-2,27.483504151170617,26.262328558314874,721.78081595185347,null,null,null,95,0.90941610193193734,90.583898068062695,1.0996066573657854,99.606657365785438]
[96,3.6789714694713371E-2,27.520293865865327,27.181510057855888,748.04314451016819,null,null,null,96,0.90850759433759987,91.492405662400159,1.1007062640231511,100.70626402315108]
[97,{"$f":"1/(1+$H$1)^A98","v":3.5545618062525E-2},27.555839483927855,28.132862909880842,775.22465456802399,null,null,null,97,0.90759999434325656,92.400005656743417,1.1018069702871742,101.80697028717422]
[98,{"$f":"1/(1+$H$1)^A99","v":3.434359233094203E-2},27.590183076258796,29.117513111726669,803.35751747790482,null,null,null,98,0.90669330104221479,93.306698957785159,1.1029087772574608,102.90877725746084]
[99,{"$f":"1/(1+$H$1)^A100","v":3.3182214812504378E-2},27.623365291071302,30.136626070637099,832.47503058963139,null,null,null,99,0.90578751352868625,94.212486471313795,1.1040116860347182,104.01168603471822]
[100,{"$f":"1/(1+$H$1)^A101","v":3.2060110929955921E-2},27.655425402001256,31.191407983109396,862.61165666026841,null,null,null,100,0.90488263089778831,95.117369102211654,1.105115697720753,105.11569772075302]

{"sheet":"Berechnungsgrundlagen","index":39,"n_rows":146,"n_cols":17,"rows_kept":146,"cut":false,"hidden":true,"merged":[[46,1,46,2],[2,12,2,14],[3,12,3,13],[2,15,2,16]]}
["Zu 5.1 Projektgrunddaten",null,null,null,null,null,"PW","KNU14"]
[null,null,null,null,null,null,null,null,null,null,null,1,2,3,4,5,6]
["Bundesland",null,"Projekttyp",null,"Anzahl",null,null,"Maßnahme",null,null,null,null,"Stützstellen",null,null,"Tabellenzeilen"]
["Österreich",null,"Gewässerentwicklungskonzept",null,1,null,1,"Linearmaßnahmen",1,null,null,"Sheet","1. Spate",null,"Anzahl","erste","letzte"]
["Burgenland",null,"Generelles Projekt ",null,2,null,2,"Retentions- oder Kombimaßnahmen",2,null,null,"Titelblatt"]
["Kärnten",null,"Detailprojekt",null,3,null,{"$f":"+E22","v":"A1"},"Linearmaßnahmen",{"$f":"VLOOKUP(H6,$H$4:$I$5,2,TRUE)","v":1},null,null,"INHALTSVERZEICHNIS"]
["Niederösterreich",null,null,null,4,null,{"$f":"+E23","v":"A2"},"Linearmaßnahmen",{"$f":"VLOOKUP(H7,$H$4:$I$5,2,TRUE)","v":1},null,null,"Projektgrunddaten"]
["Oberösterreich",null,null,null,5,null,{"$f":"+E24","v":"A3"},"Linearmaßnahmen",{"$f":"VLOOKUP(H8,$H$4:$I$5,2,TRUE)","v":1},null,null,"Flächennutzungen","C",3,2]
["Salzburg",null,null,null,6,null,{"$f":"+E25","v":"A4"},"Linearmaßnahmen",{"$f":"VLOOKUP(H9,$H$4:$I$5,2,TRUE)","v":1},null,null,"Bevölkerung, Beschäftige","C",3,1]
["Steiermark",null,"Anzahl der HQ-Stützstellen",7,7,null,null,null,null,null,null,"Schadensrel. Merkmale WGebäude",null,null,null,7,8]
["Tirol",null,"Bemessungshochwasser (Pos)",6,8,null,"Nicht mehr gültig",null,null,null,null,"Schadensermittlung Wohngebäude","C",3,16,7,8]
["Vorarlberg",null,"Bemessungshochwasser (dynamisch)",{"$f":"INDIRECT(ADDRESS(23+HQ100_Nr,3,1,TRUE,\"Projektgrunddaten\"),TRUE)","v":100},null,null,{"$f":"+E23","v":"A2"},"Retentions- oder Kombimaßnahmen",{"$f":"VLOOKUP(H12,$H$4:$I$5,2,TRUE)","v":2},null,null,"Schadensrel. MM NichtWGebäude",null,null,null,7,8]
["Wien",null,null,null,null,null,null,null,null,null,null,"Schadensermittl.  NichtWGebäude","C",3,16,7,8]
[null,null,null,null,null,null,null,null,null,null,null,"Schadenseingabe Öffentl. Geb.","D",4,2,7,8]
["Zu 5.3.1.1 und 5.3.1.2 Wohngebäude/Nicht-Wohngebäude",null,null,null,null,null,null,null,null,null,null,"Wertschöpfungsverluste","D",4,2]
[null,null,null,"Wassereintritt in Keller nur von EG innen möglich?",null,null,null,"Nicht-Wohngebäude",null,null,null,"Infrastruktur","D",4,2]
["Normhaus","m",null,"Ja",null,null,null,"NormGebäude",null,null,null,"Wasserbauliche Anlagen","C",3,1]
["Höhe Keller",2.2999999999999998,null,"Nein",null,null,null,"Höhe Keller",3,null,null,"Land-, Forstwirtschaft","C",3,1]
["Kellerdecke",0.3,null,null,null,null,null,"Kellerdecke",0.3,null,null,"Sonstige Flächennutzungen","E",5,1]
["Höhe Erdgeschoß",2.5,null,"Alternativen",null,null,null,"Höhe Erdgeschoß",3,null,null,"Fremdenverkehr","D",4,1]
["Decke Erdgeschoß",0.2,null,"ausgewählte Alternative",4,"Anzahl",null,"Decke Erdgeschoß",0.3,null,null,"Summe monetär bewertete Schäden","E",5,1]
["Höhe 1. Stock",2.5,null,"Name Alternative 1","A1",1,null,"Höhe 1. Stock",3,null,null,"Schadenserwartungen"]
[null,null,null,"Name Alternative 2","A2",2,null,null,null,null,null,"A1 Kostenermittlung"]
[null,null,null,"Name Alternative 3","A3",3,null,null,null,null,null,"A1 monetäre  ökonom Effizienz"]
["Zu 5.3.1.3 Versorgung",null,null,"Name Alternative 4","A4",4,null,null,null,null,null,"A1 Weitere Projektwirkungen"]
[null,null,null,null,null,null,null,null,null,null,null,"A1 Zssfg Teilbilanzen"]
[null,"Räumungskosten","Reinigungskosten","Reparaturkosten","Sonderkosten Eisenbahn",null,null,null,null,null,null,"A2 Kostenermittlung"]
[null,"€/m³","€/m2","€/lfm",null,"€",null,null,null,null,null,"A2 monetäre  ökonom Effizienz"]
["Autobahn, Schnellstraße",{"$f":"23*Wertanpassung!E13/100","v":28.135288552507095},{"$f":"3*Wertanpassung!E13/100","v":3.6698202459791869},{"$f":"2575*Wertanpassung!E13/100","v":3149.9290444654685},"Schadenfeststellung",{"$f":"1638*Wertanpassung!E13/100","v":2003.7218543046358},null,null,null,null,null,"A2 Weitere Projektwirkungen"]
["Landesstraße B",{"$f":"18*Wertanpassung!E13/100","v":22.018921475875118},{"$f":"3*Wertanpassung!E13/100","v":3.6698202459791869},{"$f":"702*Wertanpassung!E13/100","v":858.73793755912959},null,"€/Tag",null,null,null,null,null,"A2 Zssfg Teilbilanzen"]
["Landesstraße L",{"$f":"18*Wertanpassung!E13/100","v":22.018921475875118},{"$f":"2*Wertanpassung!E13/100","v":2.4465468306527911},{"$f":"527*Wertanpassung!E13/100","v":644.66508987701047},"Überwachung",{"$f":"1873*Wertanpassung!E13/100","v":2291.191106906339},null,null,null,null,null,"A3 Kostenermittlung"]
["Gemeindestraße, \nöffentliche Wege",{"$f":"18*Wertanpassung!E13/100","v":22.018921475875118},{"$f":"2*Wertanpassung!E13/100","v":2.4465468306527911},{"$f":"527*Wertanpassung!E13/100","v":644.66508987701047},"Langsamfahren 1-gleisige Strecke",{"$f":"3277*Wertanpassung!E13/100","v":4008.6669820245979},null,null,null,null,null,"A3 monetäre  ökonom Effizienz"]
["sonstige Wege",{"$f":"12*Wertanpassung!E13/100","v":14.679280983916748},{"$f":"2*Wertanpassung!E13/100","v":2.4465468306527911},{"$f":"12*Wertanpassung!E13/100","v":14.679280983916748},"Langsamfahren 2-gleisige Strecke",{"$f":"7958*Wertanpassung!E13/100","v":9734.8098391674557},null,null,null,null,null,"A3 Weitere Projektwirkungen"]
[null,"€/lfm",null,null,"Quelle: ÖBB",null,null,null,null,null,null,"A3 Zssfg Teilbilanzen"]
["Bahn 1-gleisig",{"$f":"59*Wertanpassung!E13/100","v":72.173131504257341},null,{"$f":"3511*Wertanpassung!E13/100","v":4294.9129612109746},null,null,null,null,null,null,null,"A4 Kostenermittlung"]
["Bahn 2-gleisig",{"$f":"117*Wertanpassung!E13/100","v":143.12298959318827},null,{"$f":"7022*Wertanpassung!E13/100","v":8589.8259224219491},null,null,null,null,null,null,null,"A4 monetäre  ökonom Effizienz"]
["Quelle: WLV/ÖBB Infra/ASFINAG/eigene Erhebungen, Stand 2007",null,null,"Quelle:WLV/nach Amt der Steiermärkischen Landesregierung (Richtpreise)",null,null,null,null,null,null,null,"A4 Weitere Projektwirkungen"]
[null,null,null,null,null,null,null,null,null,null,null,"A4 Zssfg Teilbilanzen"]
[null,null,null,null,null,null,null,null,null,null,null,"Alternativenvergleich"]
["Kosten für","Umleitung","Sperre",null,"Gebäudetyp",null,null,"Fussbodenoberkante",null,null,null,"Einordnung in integrales HWSM"]
[null,"€/km","€/Tg",null,"EFH",null,null,"Unterflur",null,null,null,"Daten für Bruttowertschöpfung"]
["Autobahn, Schnellstraße",{"$f":"0.5*Wertanpassung!C13/100","v":0.57907425265188039},{"$f":"67803*Wertanpassung!E13/100","v":82941.607379375593},null,"MFH",null,null,"Ebenerdig",null,null,null,"Faktoren"]
["Landesstraße B",{"$f":"0.5*Wertanpassung!C13/100","v":0.57907425265188039},{"$f":"45202*Wertanpassung!E13/100","v":55294.404919583729},null,"RH",null,null,"Höher",null,null,null,"Detailliste Wirtschaftszweige"]
["Landesstraße L",{"$f":"0.5*Wertanpassung!C13/100","v":0.57907425265188039},{"$f":"33901*Wertanpassung!E13/100","v":41470.192052980135},null,"Sonst.",null,null,null,null,null,null,"Berechnungsgrundlagen"]
["Gemeindestraße",{"$f":"0.5*Wertanpassung!C13/100","v":0.57907425265188039},{"$f":"22601*Wertanpassung!E13/100","v":27647.202459791864},null,null,null,null,"Anfälligkeitsgrad",null,null,null,"Wertanpassung"]
["sonstige Wege",{"$f":"0.5*Wertanpassung!C13/100","v":0.57907425265188039},{"$f":"5650/2*Wertanpassung!E13/100","v":3455.7473982970673},null,"BauwerksTyp",null,null,"keine",null,null,null,"Evaluierung"]
["sonstige Verkehrsanlagen","Kosten je nach Art der Anlage",null,null,"ZH",null,null,"volle",null,null,null,"Evaluierung-Hilfe"]
["Bahn 1-gleisig","-",{"$f":"42377*Wertanpassung!E13/100","v":51838.657521286659},null,"BH"]
["Bahn 2-gleisig","-",{"$f":"46897*Wertanpassung!E13/100","v":57367.853358561973},null,"HH",null,null,"Nutzung"]
[null,null,null,null,"STH",null,null,"gering"]
["Kraftfahrzeuge",null,null,null,"Sonst.",null,null,"mittel"]
["Zeitwert",9900,"lt. Auswertung DC 2005 (8700 €) , 2009: (9900 €)",null,"Zustand",null,null,"hoch"]
[0.5,{"$f":"B52*A53*Wertanpassung!C13/100","v":5732.8351012536159},null,null,"sehr gut"]
["Betroffenheit",null,null,null,"gut"]
["Bereich 1",0.2,null,null,"schlecht"]
["Bereich 2",0.4,null,null,"sehr schlecht"]
["Bereich 3",0.75]
[]
["Freileitungen",null,"Reparaturkosten Freileitungen mit Masten \nin €/lfm"]
[0,null,0]
["10 -25 kV",null,{"$f":"149*Wertanpassung!E13/100","v":182.26773888363292}]
["110 kV",null,{"$f":"702*Wertanpassung!E13/100","v":858.73793755912959}]
["220 kV",null,{"$f":"885*Wertanpassung!E13/100","v":1082.5969725638599}]
["380 kV",null,{"$f":"1404*Wertanpassung!E13/100","v":1717.4758751182592}]
["Daten 2007 von TIWAG Netz, ORF Leitungsbau, nach WLV"]
[]
["Umleitungskosten","€/km"]
[null,{"$f":"0.45*Wertanpassung!C13/100","v":0.52116682738669229}]
["Brücke","€/m²"]
["Neubau ",{"$f":"2000*Wertanpassung!G13/100","v":2288.4071630537233}]
[]
["Räumung Kanal","€/lfm"]
["Richtwert",{"$f":"2*Wertanpassung!C13/100","v":2.3162970106075216}]
[]
[]
["Zu 5.3.1.5 Land- und Forstwirtschaft"]
[]
["Landwirtschaft (Blatt 5.3.1.5)","€/ha"]
["Grünland",{"$f":"2453.28*Wertanpassung!C13/100","v":2841.2625650916102}]
["Ackerland (Getreide, Hülsenfrüchte)",{"$f":"3271.05*Wertanpassung!C13/100","v":3788.3616682738671}]
["Anm.: Daten von WLV, 2005"]
[]
["Zu 5.3.1.6 Sonstige Nutzungen"]
[]
["Sonstige Nutzungen (Blatt 5.3.1.6)","€/m²"]
["Grünflächen",{"$f":"1*Wertanpassung!C13/100","v":1.1581485053037608}]
["Sport- und Freizeitflächen",{"$f":"2*Wertanpassung!C13/100","v":2.3162970106075216}]
["Campingplätze",{"$f":"2*Wertanpassung!C13/100","v":2.3162970106075216}]
["Parkanlagen",{"$f":"2*Wertanpassung!C13/100","v":2.3162970106075216}]
["Friedhöfe",{"$f":"2*Wertanpassung!C13/100","v":2.3162970106075216}]
["Kleingartensiedlungen",{"$f":"3*Wertanpassung!C13/100","v":3.4744455159112824}]
["Anm: Daten aus Flood Risk, Traisental (Günther &Schmidtke 1988)"]
["ursprügl. Wert 2,56 angepaßt um Baukostenindex"]
[]
["Zu 5.3.1.7 Fremdenverkehr"]
[null,null,null,"Rechenwerte Fremdenverkehr"]
[null,null,null,"50 % Essen + 100 % NK"]
["Bundesland","Tagesausgaben für Essen und Trinken in €/Tag/Person",null,"Bundesland","Tagesausgaben in €/Tag/Person"]
["Burgenland",18,null,"Burgenland",{"$f":"ROUND(SUM(B99/2)+B111,0)*Wertanpassung!C13/100","v":27.795564127290259}]
["Kärnten",21,null,"Kärnten",{"$f":"ROUND(SUM(B100/2)+B112,0)*Wertanpassung!C13/100","v":34.744455159112825}]
["Niederösterreich",18,null,"Niederösterreich",{"$f":"ROUND(SUM(B101/2)+B113,0)*Wertanpassung!C13/100","v":37.060752169720345}]
["Oberösterreich",22,null,"Oberösterreich",{"$f":"ROUND(SUM(B102/2)+B114,0)*Wertanpassung!C13/100","v":41.693346190935387}]
["Salzburg",22,null,"Salzburg",{"$f":"ROUND(SUM(B103/2)+B115,0)*Wertanpassung!C13/100","v":41.693346190935387}]
["Steiermark",18,null,"Steiermark",{"$f":"ROUND(SUM(B104/2)+B116,0)*Wertanpassung!C13/100","v":35.902603664416581}]
["Tirol",24,null,"Tirol",{"$f":"ROUND(SUM(B105/2)+B117,0)*Wertanpassung!C13/100","v":42.851494696239151}]
["Vorarlberg",25,null,"Vorarlberg",{"$f":"ROUND(SUM(B106/2)+B118,0)*Wertanpassung!C13/100","v":40.53519768563163}]
["Wien",34,null,"Wien",{"$f":"ROUND(SUM(B107/2)+B119,0)*Wertanpassung!C13/100","v":62.540019286403087}]
["Werte für 2007, Daten von STATISTIK AUSTRIA/WLV"]
[]
["Bundesland","Nebenausgaben in €/Tag/Person"]
["Burgenland",15]
["Kärnten",19]
["Niederösterreich",23]
["Oberösterreich",25]
["Salzburg",25]
["Steiermark",22]
["Tirol",25]
["Vorarlberg",22]
["Wien",37]
["Werte für 2007 Daten von STATISTIK AUSTRIA/WLV"]
[]
[]
["Zu 5.5.1 DARSTELLUNG UND BEURTEILUNG DER WEITEREN PROJEKTWIRKUNGEN"]
[]
["Auswirkung","Auswirkung1"]
["positiv","gering"]
["negativ","mittel"]
[null,"hoch"]
[]
["Zu 5.6 ZUSAMMENFASSUNG DER TEILBILANZEN EINER ALTERNATIVE"]
[]
["Gesamtbeurteilung","Teilbilanz 1","Teilbilanz 2","Abwägung und Würdigung"]
[null,"positiv","negativ"]
["positiv","Projekt gesamtgesellschaftlich vorteilhaft","vorteilhaft"]
["negativ","vorteilhaft","Projekt gesamtgesellschaftlich nicht vorteilhaft"]
[]
["Bewertung"]
["Projekt gesamtgesellschaftlich nicht vorteilhaft"]
["Projekt gesamtgesellschaftlich vorteilhaft"]
[]
["Alternativenvergleich"]
[" "]
[1]
[2]
[3]
[4]

{"sheet":"Wertanpassung","index":40,"n_rows":18,"n_cols":8,"rows_kept":18,"cut":false,"hidden":true,"merged":[]}
[null,"Tabellen jährliche Wertanpassung"]
[]
[null,"Jahr","Verbraucherpreisindex","zum Vorjahr","Baupreisindex (Straßenbau)","zum Vorjahr","Baupreisindex (Brückenbau)","zum Vorjahr"]
[null,2007,103.7,null,105.7,null,106.1]
[null,2010,109.5,{"$f":"(C5-C4)/C4","v":5.5930568948891E-2},121.3,{"$f":"(E5-E4)/E4","v":0.14758751182592236},117,{"$f":"(G5-G4)/G4","v":0.10273327049952881}]
[null,2014,120.1,{"$f":"(C6-C5)/C5","v":9.6803652968036474E-2},129.30000000000001,{"$f":"(E6-E5)/E5","v":6.5952184666117186E-2},121.4,{"$f":"(G6-G5)/G5","v":3.7606837606837654E-2}]
[null,2015,100,-0.16736053288925892,100,-0.22660479505027076,100,-0.17627677100494238]
[null,2016,100,0,100,0,100,0]
[null,2017,100,0,100,0,100,0]
[null,2018,100,0,100,0,100,0]
[null,2019,100,0,100,0,100,0]
[null,2020,100,0,100,0,100,0]
[null,"Rechenwert",{"$f":"C6/C4*100","v":115.81485053037608},null,{"$f":"E6/E4*100","v":122.32734153263955},null,{"$f":"G6/G4*100","v":114.42035815268616}]
[]
[]
[]
[null,"Quelle: STATISTIK AUSTRIA, www.statistik.at; 2014"]
[null,null," Rechenwert = Verknüpfung mit den Vorgaben im Blatt Berechnungsgrundlagen"]

{"sheet":"test","index":41,"n_rows":157,"n_cols":13,"rows_kept":157,"cut":false,"hidden":true,"merged":[]}
[]
["Grunddaten"]
[null,"Projektbezeichnung",{"$f":"Projektgrunddaten!$C$3","v":0}]
[null,"Maßnahme"]
[null,"Stützstellen",{"$f":"CONCATENATE(IF(HQanzahl>=1,Projektgrunddaten!$C$24,\"\"),IF(HQanzahl>=2,\" / \" & Projektgrunddaten!$C$25,\"\"),IF(HQanzahl>=3,\" / \" & Projektgrunddaten!$C$26,\"\"),IF(HQanzahl>=4,\" / \" & Projektgrunddaten!$C$27,\"\"),IF(HQanzahl>=5,\" / \" & Projektgrunddaten!$C$28,\"\"),IF(HQanzahl>=6,\" / \" & Projektgrunddaten!$C$29,\"\"),IF(HQanzahl>=7,\" / \" & Projektgrunddaten!$C$30,\"\"))","v":" /  /  /  /  / 100 / "}]
[null,"Ausuferungsbeginn",{"$f":"Projektgrunddaten!$C$23","v":0}]
[null,"BHQ",{"$f":"INDEX(Projektgrunddaten!$C$24:$C$30,HQ100_Nr,1)","v":100}]
[]
["Flächennutzung"]
[null,"Fläche WG [m²]",{"$f":"INDIRECT(ADDRESS(H10,VLOOKUP(G10,Berechnungsgrundlagen!$L$5:$O$47,3,FALSE)+(F10-1)+((HQ100_Nr-1)*VLOOKUP(G10,Berechnungsgrundlagen!$L$5:$O$47,4,FALSE)),1,TRUE,G10),TRUE)","v":0},null,19,2,"Flächennutzungen",{"$f":"VLOOKUP(G10,Berechnungsgrundlagen!$L$5:$Q$47,6,FALSE)+E10","v":19}]
[null,"Fläche NWG [m²]",{"$f":"INDIRECT(ADDRESS(H11,VLOOKUP(G11,Berechnungsgrundlagen!$L$5:$O$47,3,FALSE)+(F11-1)+((HQ100_Nr-1)*VLOOKUP(G11,Berechnungsgrundlagen!$L$5:$O$47,4,FALSE)),1,TRUE,G11),TRUE)","v":0},null,20,2,"Flächennutzungen",{"$f":"VLOOKUP(G11,Berechnungsgrundlagen!$L$5:$Q$47,6,FALSE)+E11","v":20}]
[null,"Fläche bebaute Grundstücke [m²]",{"$f":"INDIRECT(ADDRESS(H12,VLOOKUP(G12,Berechnungsgrundlagen!$L$5:$O$47,3,FALSE)+(F12-1)+((HQ100_Nr-1)*VLOOKUP(G12,Berechnungsgrundlagen!$L$5:$O$47,4,FALSE)),1,TRUE,G12),TRUE)","v":0},null,21,2,"Flächennutzungen",{"$f":"VLOOKUP(G12,Berechnungsgrundlagen!$L$5:$Q$47,6,FALSE)+E12","v":21}]
[null,"Fläche Verkehrsinfrastruktur gesamt [BHQ) [m²]",{"$f":"INDIRECT(ADDRESS(H13,VLOOKUP(G13,Berechnungsgrundlagen!$L$5:$O$47,3,FALSE)+(F13-1)+((HQ100_Nr-1)*VLOOKUP(G13,Berechnungsgrundlagen!$L$5:$O$47,4,FALSE)),1,TRUE,G13),TRUE)","v":0},null,34,2,"Flächennutzungen",{"$f":"VLOOKUP(G13,Berechnungsgrundlagen!$L$5:$Q$47,6,FALSE)+E13","v":34}]
[null,"Land- und forstw. Flächen gesamt [m²]",{"$f":"INDIRECT(ADDRESS(H14,VLOOKUP(G14,Berechnungsgrundlagen!$L$5:$O$47,3,FALSE)+(F14-1)+((HQ100_Nr-1)*VLOOKUP(G14,Berechnungsgrundlagen!$L$5:$O$47,4,FALSE)),1,TRUE,G14),TRUE)","v":0},null,43,2,"Flächennutzungen",{"$f":"VLOOKUP(G14,Berechnungsgrundlagen!$L$5:$Q$47,6,FALSE)+E14","v":43}]
[null,"Sonstige Flächennutzung gesamt [m²]",{"$f":"INDIRECT(ADDRESS(H15,VLOOKUP(G15,Berechnungsgrundlagen!$L$5:$O$47,3,FALSE)+(F15-1)+((HQ100_Nr-1)*VLOOKUP(G15,Berechnungsgrundlagen!$L$5:$O$47,4,FALSE)),1,TRUE,G15),TRUE)","v":0},null,55,2,"Flächennutzungen",{"$f":"VLOOKUP(G15,Berechnungsgrundlagen!$L$5:$Q$47,6,FALSE)+E15","v":55}]
[null,"Betroffene Fläche gesamt [m²]",{"$f":"INDIRECT(ADDRESS(H16,VLOOKUP(G16,Berechnungsgrundlagen!$L$5:$O$47,3,FALSE)+(F16-1)+((HQ100_Nr-1)*VLOOKUP(G16,Berechnungsgrundlagen!$L$5:$O$47,4,FALSE)),1,TRUE,G16),TRUE)","v":0},null,60,2,"Flächennutzungen",{"$f":"VLOOKUP(G16,Berechnungsgrundlagen!$L$5:$Q$47,6,FALSE)+E16","v":60}]
[]
["Anzahl der betroffene Personen"]
[null,"Anzahl Direkt Betroffene",{"$f":"INDIRECT(ADDRESS(H19,VLOOKUP(G19,Berechnungsgrundlagen!$L$5:$O$47,3,FALSE)+(F19-1)+((HQ100_Nr-1)*VLOOKUP(G19,Berechnungsgrundlagen!$L$5:$O$47,4,FALSE)),1,TRUE,G19),TRUE)","v":0},null,5,1,"Bevölkerung, Beschäftige",{"$f":"VLOOKUP(G19,Berechnungsgrundlagen!$L$5:$Q$47,6,FALSE)+E19","v":5}]
[null,"Anzahl Indirekt Betroffene",{"$f":"INDIRECT(ADDRESS(H20,VLOOKUP(G20,Berechnungsgrundlagen!$L$5:$O$47,3,FALSE)+(F20-1)+((HQ100_Nr-1)*VLOOKUP(G20,Berechnungsgrundlagen!$L$5:$O$47,4,FALSE)),1,TRUE,G20),TRUE)","v":0},null,6,1,"Bevölkerung, Beschäftige",{"$f":"VLOOKUP(G20,Berechnungsgrundlagen!$L$5:$Q$47,6,FALSE)+E20","v":6}]
[]
["Anzahl der Wohngebäude"]
[null,"Anzahl EFH",{"$f":"INDIRECT(ADDRESS(H23,VLOOKUP(G23,Berechnungsgrundlagen!$L$5:$O$47,3,FALSE)+(F23-1)+((HQ100_Nr-1)*VLOOKUP(G23,Berechnungsgrundlagen!$L$5:$O$47,4,FALSE)),1,TRUE,G23),TRUE)","v":0},null,22,1,"Schadensermittlung Wohngebäude",{"$f":"VLOOKUP(G23,Berechnungsgrundlagen!$L$5:$Q$47,6,FALSE)+E23","v":30},null,{"$f":"INDIRECT(ADDRESS(H23,VLOOKUP(G23,Berechnungsgrundlagen!$L$5:$O$47,3,FALSE)+(F23-1)+((HQ100_Nr-1)*VLOOKUP(G23,Berechnungsgrundlagen!$L$5:$O$47,4,FALSE)),1,TRUE,G23),TRUE)","v":0},null,null,{"$f":"VLOOKUP(G23,Berechnungsgrundlagen!$L$5:$O$47,3,FALSE)","v":3}]
[null,"Anzahl MFH",{"$f":"INDIRECT(ADDRESS(H24,VLOOKUP(G24,Berechnungsgrundlagen!$L$5:$O$47,3,FALSE)+(F24-1)+((HQ100_Nr-1)*VLOOKUP(G24,Berechnungsgrundlagen!$L$5:$O$47,4,FALSE)),1,TRUE,G24),TRUE)","v":0},null,23,1,"Schadensermittlung Wohngebäude",{"$f":"VLOOKUP(G24,Berechnungsgrundlagen!$L$5:$Q$47,6,FALSE)+E24","v":31},null,null,null,null,{"$f":"HQ100_Nr","v":6}]
[null,"Anzahl RH",{"$f":"INDIRECT(ADDRESS(H25,VLOOKUP(G25,Berechnungsgrundlagen!$L$5:$O$47,3,FALSE)+(F25-1)+((HQ100_Nr-1)*VLOOKUP(G25,Berechnungsgrundlagen!$L$5:$O$47,4,FALSE)),1,TRUE,G25),TRUE)","v":0},null,24,1,"Schadensermittlung Wohngebäude",{"$f":"VLOOKUP(G25,Berechnungsgrundlagen!$L$5:$Q$47,6,FALSE)+E25","v":32},null,null,null,null,{"$f":"VLOOKUP(G23,Berechnungsgrundlagen!$L$5:$O$47,4,FALSE)","v":16}]
[null,"Anzahl Sonst.",{"$f":"INDIRECT(ADDRESS(H26,VLOOKUP(G26,Berechnungsgrundlagen!$L$5:$O$47,3,FALSE)+(F26-1)+((HQ100_Nr-1)*VLOOKUP(G26,Berechnungsgrundlagen!$L$5:$O$47,4,FALSE)),1,TRUE,G26),TRUE)","v":0},null,25,1,"Schadensermittlung Wohngebäude",{"$f":"VLOOKUP(G26,Berechnungsgrundlagen!$L$5:$Q$47,6,FALSE)+E26","v":33}]
[null,"Anzahl Objekte ges.",{"$f":"SUM(C23:C26)","v":0}]
[]
[null,"Anzahl EFH mit Keller",{"$f":"INDIRECT(ADDRESS(H29,VLOOKUP(G29,Berechnungsgrundlagen!$L$5:$O$47,3,FALSE)+(F29-1)+((HQ100_Nr-1)*VLOOKUP(G29,Berechnungsgrundlagen!$L$5:$O$47,4,FALSE)),1,TRUE,G29),TRUE)","v":0},null,28,1,"Schadensermittlung Wohngebäude",{"$f":"VLOOKUP(G29,Berechnungsgrundlagen!$L$5:$Q$47,6,FALSE)+E29","v":36}]
[null,"Anzahl MFH mit Keller",{"$f":"INDIRECT(ADDRESS(H30,VLOOKUP(G30,Berechnungsgrundlagen!$L$5:$O$47,3,FALSE)+(F30-1)+((HQ100_Nr-1)*VLOOKUP(G30,Berechnungsgrundlagen!$L$5:$O$47,4,FALSE)),1,TRUE,G30),TRUE)","v":0},null,29,1,"Schadensermittlung Wohngebäude",{"$f":"VLOOKUP(G30,Berechnungsgrundlagen!$L$5:$Q$47,6,FALSE)+E30","v":37}]
[]
["Schaden bei Wohngebäude gesamt"]
[null,"Schaden EFH ges. [€]",{"$f":"INDIRECT(ADDRESS(H33,VLOOKUP(G33,Berechnungsgrundlagen!$L$5:$O$47,3,FALSE)+(F33-1)+((HQ100_Nr-1)*VLOOKUP(G33,Berechnungsgrundlagen!$L$5:$O$47,4,FALSE)),1,TRUE,G33),TRUE)","v":0},null,32,1,"Schadensermittlung Wohngebäude",{"$f":"VLOOKUP(G33,Berechnungsgrundlagen!$L$5:$Q$47,6,FALSE)+E33","v":40}]
[null,"Schaden MFH ges. [€]",{"$f":"INDIRECT(ADDRESS(H34,VLOOKUP(G34,Berechnungsgrundlagen!$L$5:$O$47,3,FALSE)+(F34-1)+((HQ100_Nr-1)*VLOOKUP(G34,Berechnungsgrundlagen!$L$5:$O$47,4,FALSE)),1,TRUE,G34),TRUE)","v":0},null,33,1,"Schadensermittlung Wohngebäude",{"$f":"VLOOKUP(G34,Berechnungsgrundlagen!$L$5:$Q$47,6,FALSE)+E34","v":41}]
[null,"Schaden RH ges. [€]",{"$f":"INDIRECT(ADDRESS(H35,VLOOKUP(G35,Berechnungsgrundlagen!$L$5:$O$47,3,FALSE)+(F35-1)+((HQ100_Nr-1)*VLOOKUP(G35,Berechnungsgrundlagen!$L$5:$O$47,4,FALSE)),1,TRUE,G35),TRUE)","v":0},null,34,1,"Schadensermittlung Wohngebäude",{"$f":"VLOOKUP(G35,Berechnungsgrundlagen!$L$5:$Q$47,6,FALSE)+E35","v":42}]
[null,"Schaden Sonst. ges. [€]",{"$f":"INDIRECT(ADDRESS(H36,VLOOKUP(G36,Berechnungsgrundlagen!$L$5:$O$47,3,FALSE)+(F36-1)+((HQ100_Nr-1)*VLOOKUP(G36,Berechnungsgrundlagen!$L$5:$O$47,4,FALSE)),1,TRUE,G36),TRUE)","v":0},null,35,1,"Schadensermittlung Wohngebäude",{"$f":"VLOOKUP(G36,Berechnungsgrundlagen!$L$5:$Q$47,6,FALSE)+E36","v":43}]
[null,"Schaden Objekte ges. [€]",{"$f":"INDIRECT(ADDRESS(H37,VLOOKUP(G37,Berechnungsgrundlagen!$L$5:$O$47,3,FALSE)+(F37-1)+((HQ100_Nr-1)*VLOOKUP(G37,Berechnungsgrundlagen!$L$5:$O$47,4,FALSE)),1,TRUE,G37),TRUE)","v":0},null,36,1,"Schadensermittlung Wohngebäude",{"$f":"VLOOKUP(G37,Berechnungsgrundlagen!$L$5:$Q$47,6,FALSE)+E37","v":44}]
[]
[null,"Schaden Keller EFH ges. [€]",{"$f":"INDIRECT(ADDRESS(H39,VLOOKUP(G39,Berechnungsgrundlagen!$L$5:$O$47,3,FALSE)+(F39-1)+((HQ100_Nr-1)*VLOOKUP(G39,Berechnungsgrundlagen!$L$5:$O$47,4,FALSE)),1,TRUE,G39),TRUE)","v":0},null,38,1,"Schadensermittlung Wohngebäude",{"$f":"VLOOKUP(G39,Berechnungsgrundlagen!$L$5:$Q$47,6,FALSE)+E39","v":46}]
[null,"Schaden Keller MFH ges. [€]",{"$f":"INDIRECT(ADDRESS(H40,VLOOKUP(G40,Berechnungsgrundlagen!$L$5:$O$47,3,FALSE)+(F40-1)+((HQ100_Nr-1)*VLOOKUP(G40,Berechnungsgrundlagen!$L$5:$O$47,4,FALSE)),1,TRUE,G40),TRUE)","v":0},null,39,1,"Schadensermittlung Wohngebäude",{"$f":"VLOOKUP(G40,Berechnungsgrundlagen!$L$5:$Q$47,6,FALSE)+E40","v":47}]
[null,"Schaden Erdgeschoß EFH ges. [€]",{"$f":"INDIRECT(ADDRESS(H41,VLOOKUP(G41,Berechnungsgrundlagen!$L$5:$O$47,3,FALSE)+(F41-1)+((HQ100_Nr-1)*VLOOKUP(G41,Berechnungsgrundlagen!$L$5:$O$47,4,FALSE)),1,TRUE,G41),TRUE)","v":0},null,40,1,"Schadensermittlung Wohngebäude",{"$f":"VLOOKUP(G41,Berechnungsgrundlagen!$L$5:$Q$47,6,FALSE)+E41","v":48}]
[null,"Schaden Erdgeschoß MFH ges. [€]",{"$f":"INDIRECT(ADDRESS(H42,VLOOKUP(G42,Berechnungsgrundlagen!$L$5:$O$47,3,FALSE)+(F42-1)+((HQ100_Nr-1)*VLOOKUP(G42,Berechnungsgrundlagen!$L$5:$O$47,4,FALSE)),1,TRUE,G42),TRUE)","v":0},null,41,1,"Schadensermittlung Wohngebäude",{"$f":"VLOOKUP(G42,Berechnungsgrundlagen!$L$5:$Q$47,6,FALSE)+E42","v":49}]
[]
["Mittlerer Schaden bei Wohngebäuden"]
[null,"Schaden je EFH  [€]",{"$f":"INDIRECT(ADDRESS(H45,VLOOKUP(G45,Berechnungsgrundlagen!$L$5:$O$47,3,FALSE)+(F45-1)+((HQ100_Nr-1)*VLOOKUP(G45,Berechnungsgrundlagen!$L$5:$O$47,4,FALSE)),1,TRUE,G45),TRUE)","v":0},null,44,1,"Schadensermittlung Wohngebäude",{"$f":"VLOOKUP(G45,Berechnungsgrundlagen!$L$5:$Q$47,6,FALSE)+E45","v":52}]
[null,"Schaden je MFH [€]",{"$f":"INDIRECT(ADDRESS(H46,VLOOKUP(G46,Berechnungsgrundlagen!$L$5:$O$47,3,FALSE)+(F46-1)+((HQ100_Nr-1)*VLOOKUP(G46,Berechnungsgrundlagen!$L$5:$O$47,4,FALSE)),1,TRUE,G46),TRUE)","v":0},null,45,1,"Schadensermittlung Wohngebäude",{"$f":"VLOOKUP(G46,Berechnungsgrundlagen!$L$5:$Q$47,6,FALSE)+E46","v":53}]
[null,"Schaden je RH [€]",{"$f":"INDIRECT(ADDRESS(H47,VLOOKUP(G47,Berechnungsgrundlagen!$L$5:$O$47,3,FALSE)+(F47-1)+((HQ100_Nr-1)*VLOOKUP(G47,Berechnungsgrundlagen!$L$5:$O$47,4,FALSE)),1,TRUE,G47),TRUE)","v":0},null,46,1,"Schadensermittlung Wohngebäude",{"$f":"VLOOKUP(G47,Berechnungsgrundlagen!$L$5:$Q$47,6,FALSE)+E47","v":54}]
[null,"Schaden je Sonst. [€]",{"$f":"INDIRECT(ADDRESS(H48,VLOOKUP(G48,Berechnungsgrundlagen!$L$5:$O$47,3,FALSE)+(F48-1)+((HQ100_Nr-1)*VLOOKUP(G48,Berechnungsgrundlagen!$L$5:$O$47,4,FALSE)),1,TRUE,G48),TRUE)","v":0},null,47,1,"Schadensermittlung Wohngebäude",{"$f":"VLOOKUP(G48,Berechnungsgrundlagen!$L$5:$Q$47,6,FALSE)+E48","v":55}]
[null,"Schaden je Objekt [€]",{"$f":"INDIRECT(ADDRESS(H49,VLOOKUP(G49,Berechnungsgrundlagen!$L$5:$O$47,3,FALSE)+(F49-1)+((HQ100_Nr-1)*VLOOKUP(G49,Berechnungsgrundlagen!$L$5:$O$47,4,FALSE)),1,TRUE,G49),TRUE)","v":0},null,48,1,"Schadensermittlung Wohngebäude",{"$f":"VLOOKUP(G49,Berechnungsgrundlagen!$L$5:$Q$47,6,FALSE)+E49","v":56}]
[null,"Mittl. Wassertiefe bei WG [m]",{"$f":"INDIRECT(ADDRESS(H50,VLOOKUP(G50,Berechnungsgrundlagen!$L$5:$O$47,3,FALSE)+(F50-1)+((HQ100_Nr-1)*VLOOKUP(G50,Berechnungsgrundlagen!$L$5:$O$47,4,FALSE)),1,TRUE,G50),TRUE)","v":""},null,49,1,"Schadensermittlung Wohngebäude",{"$f":"VLOOKUP(G50,Berechnungsgrundlagen!$L$5:$Q$47,6,FALSE)+E50","v":57}]
[]
[null,"Schaden je Keller EFH",{"$f":"INDIRECT(ADDRESS(H52,VLOOKUP(G52,Berechnungsgrundlagen!$L$5:$O$47,3,FALSE)+(F52-1)+((HQ100_Nr-1)*VLOOKUP(G52,Berechnungsgrundlagen!$L$5:$O$47,4,FALSE)),1,TRUE,G52),TRUE)","v":""},null,51,1,"Schadensermittlung Wohngebäude",{"$f":"VLOOKUP(G52,Berechnungsgrundlagen!$L$5:$Q$47,6,FALSE)+E52","v":59}]
[null,"Schaden je Keller MFH",{"$f":"INDIRECT(ADDRESS(H53,VLOOKUP(G53,Berechnungsgrundlagen!$L$5:$O$47,3,FALSE)+(F53-1)+((HQ100_Nr-1)*VLOOKUP(G53,Berechnungsgrundlagen!$L$5:$O$47,4,FALSE)),1,TRUE,G53),TRUE)","v":""},null,52,1,"Schadensermittlung Wohngebäude",{"$f":"VLOOKUP(G53,Berechnungsgrundlagen!$L$5:$Q$47,6,FALSE)+E53","v":60}]
[null,"Schaden je EG EFH",{"$f":"INDIRECT(ADDRESS(H54,VLOOKUP(G54,Berechnungsgrundlagen!$L$5:$O$47,3,FALSE)+(F54-1)+((HQ100_Nr-1)*VLOOKUP(G54,Berechnungsgrundlagen!$L$5:$O$47,4,FALSE)),1,TRUE,G54),TRUE)","v":""},null,53,1,"Schadensermittlung Wohngebäude",{"$f":"VLOOKUP(G54,Berechnungsgrundlagen!$L$5:$Q$47,6,FALSE)+E54","v":61}]
[null,"Schaden je EG MFH",{"$f":"INDIRECT(ADDRESS(H55,VLOOKUP(G55,Berechnungsgrundlagen!$L$5:$O$47,3,FALSE)+(F55-1)+((HQ100_Nr-1)*VLOOKUP(G55,Berechnungsgrundlagen!$L$5:$O$47,4,FALSE)),1,TRUE,G55),TRUE)","v":""},null,54,1,"Schadensermittlung Wohngebäude",{"$f":"VLOOKUP(G55,Berechnungsgrundlagen!$L$5:$Q$47,6,FALSE)+E55","v":62}]
[]
[null,"Schadensanteil Keller an Gesamtschaden EFH",{"$f":"INDIRECT(ADDRESS(H57,VLOOKUP(G57,Berechnungsgrundlagen!$L$5:$O$47,3,FALSE)+(F57-1)+((HQ100_Nr-1)*VLOOKUP(G57,Berechnungsgrundlagen!$L$5:$O$47,4,FALSE)),1,TRUE,G57),TRUE)","v":""},null,56,1,"Schadensermittlung Wohngebäude",{"$f":"VLOOKUP(G57,Berechnungsgrundlagen!$L$5:$Q$47,6,FALSE)+E57","v":64}]
[null,"Schadensanteil EG an Gesamtschaden EFH",{"$f":"INDIRECT(ADDRESS(H58,VLOOKUP(G58,Berechnungsgrundlagen!$L$5:$O$47,3,FALSE)+(F58-1)+((HQ100_Nr-1)*VLOOKUP(G58,Berechnungsgrundlagen!$L$5:$O$47,4,FALSE)),1,TRUE,G58),TRUE)","v":""},null,57,1,"Schadensermittlung Wohngebäude",{"$f":"VLOOKUP(G58,Berechnungsgrundlagen!$L$5:$Q$47,6,FALSE)+E58","v":65}]
[null,"Schadensanteil Keller an Gesamtschaden MFH",{"$f":"INDIRECT(ADDRESS(H59,VLOOKUP(G59,Berechnungsgrundlagen!$L$5:$O$47,3,FALSE)+(F59-1)+((HQ100_Nr-1)*VLOOKUP(G59,Berechnungsgrundlagen!$L$5:$O$47,4,FALSE)),1,TRUE,G59),TRUE)","v":""},null,58,1,"Schadensermittlung Wohngebäude",{"$f":"VLOOKUP(G59,Berechnungsgrundlagen!$L$5:$Q$47,6,FALSE)+E59","v":66}]
[null,"Schadensanteil EG an Gesamtschaden MFH",{"$f":"INDIRECT(ADDRESS(H60,VLOOKUP(G60,Berechnungsgrundlagen!$L$5:$O$47,3,FALSE)+(F60-1)+((HQ100_Nr-1)*VLOOKUP(G60,Berechnungsgrundlagen!$L$5:$O$47,4,FALSE)),1,TRUE,G60),TRUE)","v":""},null,59,1,"Schadensermittlung Wohngebäude",{"$f":"VLOOKUP(G60,Berechnungsgrundlagen!$L$5:$Q$47,6,FALSE)+E60","v":67}]
[]
["Mittlerer Schaden bei Wohngebäuden je ha [€]"]
[null,"Schaden bei Wohngebäuden je ha bebaute Fl. [€]",{"$f":"IF(C10<>0,C37/C10*10000,\"\")","v":""}]
[]
["mittlere Smin und B-Werte für EFH"]
[null,"mittlere Smin Keller [€]",{"$f":"AVERAGEIF('Schadensrel. Merkmale WGebäude'!$B$7:$B$8,\"EFH\",'Schadensrel. Merkmale WGebäude'!$T$7:$T$8)","v":{"$error":"#DIV/0!"}}]
[null,"mittlere Smin Erdgeschoß [€]",{"$f":"AVERAGEIF('Schadensrel. Merkmale WGebäude'!$B$7:$B$8,\"EFH\",'Schadensrel. Merkmale WGebäude'!$X$7:$X$8)","v":{"$error":"#DIV/0!"}}]
[null,"mittlere B-Wert für Keller",{"$f":"AVERAGEIF('Schadensrel. Merkmale WGebäude'!$B$7:$B$8,\"EFH\",'Schadensrel. Merkmale WGebäude'!$V$7:$V$8)","v":{"$error":"#DIV/0!"}}]
[null,"mittlere B-Wert für Erdgeschoß",{"$f":"AVERAGEIF('Schadensrel. Merkmale WGebäude'!$B$7:$B$8,\"EFH\",'Schadensrel. Merkmale WGebäude'!$Z$7:$Z$8)","v":{"$error":"#DIV/0!"}}]
[]
["Standardabweichung für Smin und B-Werte für EFH"]
[null,"STABW Smin Keller",{"$f":"_xlfn.STDEV.P('Schadensrel. Merkmale WGebäude'!$U$7:$U$8)","v":{"$error":"#DIV/0!"}}]
[null,"STABW Smin EG",{"$f":"_xlfn.STDEV.P('Schadensrel. Merkmale WGebäude'!$Y$7:$Y$8)","v":{"$error":"#DIV/0!"}}]
[null,"STABW B-Wert für Keller",{"$f":"_xlfn.STDEV.P('Schadensrel. Merkmale WGebäude'!$W$7:$W$8)","v":{"$error":"#DIV/0!"}}]
[null,"STABW B-Wert für Erdgeschoß",{"$f":"_xlfn.STDEV.P('Schadensrel. Merkmale WGebäude'!$AA$7:$AA$8)","v":{"$error":"#DIV/0!"}}]
[]
["Anzahl der Nicht-Wohngebäude ges.",null,null,null,null,null,"Schadensrel. MM NichtWGebäude"]
[null,"Anzahl der Nicht-Wohngebäude ges.",{"$f":"COUNTA(INDIRECT(ADDRESS(VLOOKUP(G77,Berechnungsgrundlagen!$L$5:$Q$47,5,FALSE),1,4,TRUE,G77) & \":\" & ADDRESS(VLOOKUP(G77,Berechnungsgrundlagen!$L$5:$Q$47,6,FALSE),1,4,TRUE)))+COUNTA(INDIRECT(ADDRESS(VLOOKUP(G78,Berechnungsgrundlagen!$L$5:$Q$47,5,FALSE),1,4,TRUE,G78) & \":\" & ADDRESS(VLOOKUP(G78,Berechnungsgrundlagen!$L$5:$Q$47,6,FALSE),1,4,TRUE)))","v":0},null,null,null,"Schadenseingabe Öffentl. Geb."]
[]
["Schaden bei Nicht-Wohngebäuden gesamt [€]"]
[null,"Schaden bei Nicht-Wohngebäuden gesamt [€]",{"$f":"INDIRECT(ADDRESS(H81,VLOOKUP($G$81,Berechnungsgrundlagen!$L$5:$O$47,3,FALSE)+(F81-1)+((HQ100_Nr-1)*VLOOKUP($G$81,Berechnungsgrundlagen!$L$5:$O$47,4,FALSE)),1,TRUE,$G$81),TRUE)","v":0},null,7,1,"Summe monetär bewertete Schäden",{"$f":"VLOOKUP(G81,Berechnungsgrundlagen!$L$5:$Q$47,6,FALSE)+E81","v":7}]
[]
["Mittlerer Schaden bei Nicht-Wohngebäuden"]
[null,"mittlerer Schaden je NWG  [€]",{"$f":"IF(C78=0,\"\",C81/C78)","v":""}]
[]
["Maximaler Gesamtschaden bei Nicht-Wohngebäuden",null,null,{"$f":"INDIRECT(ADDRESS(H86,VLOOKUP($G$86,Berechnungsgrundlagen!$L$5:$O$47,3,FALSE)+(F86-1)+((HQ100_Nr-1)*VLOOKUP($G$86,Berechnungsgrundlagen!$L$5:$O$47,4,FALSE)),1,TRUE,$G$86),TRUE)","v":0},4,1,"Schadensermittl.  NichtWGebäude",{"$f":"VLOOKUP(G86,Berechnungsgrundlagen!$L$5:$Q$47,6,FALSE)+E86","v":12}]
[null,"Maximaler Gesamtschaden bei NWG [€]",{"$f":"MAX(D86:D87)","v":100},{"$f":"INDIRECT(ADDRESS(H87,VLOOKUP($G$87,Berechnungsgrundlagen!$L$5:$O$47,3,FALSE)+(F87-1)+((HQ100_Nr-1)*VLOOKUP($G$87,Berechnungsgrundlagen!$L$5:$O$47,4,FALSE)),1,TRUE,$G$87),TRUE)","v":100},4,1,"Schadenseingabe Öffentl. Geb.",{"$f":"VLOOKUP(G87,Berechnungsgrundlagen!$L$5:$Q$47,6,FALSE)+E87","v":12}]
[]
["Wertschöpfungsverluste"]
[null,"Wertschöpfungsverluste gesamt [€]",{"$f":"INDIRECT(ADDRESS(H90,VLOOKUP(G90,Berechnungsgrundlagen!$L$5:$O$47,3,FALSE)+(F90-1)+((HQ100_Nr-1)*VLOOKUP(G90,Berechnungsgrundlagen!$L$5:$O$47,4,FALSE)),1,TRUE,G90),TRUE)","v":0},null,23,1,"Wertschöpfungsverluste",{"$f":"VLOOKUP(G90,Berechnungsgrundlagen!$L$5:$Q$47,6,FALSE)+E90","v":23}]
[null,"Anzahl der Beschäftigen gesamt",{"$f":"INDIRECT(ADDRESS(H91,VLOOKUP(G91,Berechnungsgrundlagen!$L$5:$O$47,3,FALSE)+(F91-1)+((HQ100_Nr-1)*VLOOKUP(G91,Berechnungsgrundlagen!$L$5:$O$47,4,FALSE)),1,TRUE,G91),TRUE)","v":0},null,2,15,"Schadensermittl.  NichtWGebäude",{"$f":"VLOOKUP(G91,Berechnungsgrundlagen!$L$5:$Q$47,6,FALSE)+E91","v":10}]
[]
["Schäden an Infrastruktur"]
[null,"Schäden an Infrastruktur gesamt [€]",{"$f":"INDIRECT(ADDRESS(H94,VLOOKUP(G94,Berechnungsgrundlagen!$L$5:$O$47,3,FALSE)+(F94-1)+((HQ100_Nr-1)*VLOOKUP(G94,Berechnungsgrundlagen!$L$5:$O$47,4,FALSE)),1,TRUE,G94),TRUE)","v":0},null,183,1,"Infrastruktur",{"$f":"VLOOKUP(G94,Berechnungsgrundlagen!$L$5:$Q$47,6,FALSE)+E94","v":183}]
[]
["Schäden bei Anlagen und Gewässer"]
[null,"Schäden an wasserbaulichen Anlagen [€]",{"$f":"INDIRECT(ADDRESS(H97,VLOOKUP(G97,Berechnungsgrundlagen!$L$5:$O$47,3,FALSE)+(F97-1)+((HQ100_Nr-1)*VLOOKUP(G97,Berechnungsgrundlagen!$L$5:$O$47,4,FALSE)),1,TRUE,G97),TRUE)","v":0},null,26,1,"Wasserbauliche Anlagen",{"$f":"VLOOKUP(G97,Berechnungsgrundlagen!$L$5:$Q$47,6,FALSE)+E97","v":26}]
[]
["Schäden bei Land- u. Forstwirtschaft"]
[null,"Schäden bei Land- u. Forstwirtschaft",{"$f":"INDIRECT(ADDRESS(H100,VLOOKUP(G100,Berechnungsgrundlagen!$L$5:$O$47,3,FALSE)+(F100-1)+((HQ100_Nr-1)*VLOOKUP(G100,Berechnungsgrundlagen!$L$5:$O$47,4,FALSE)),1,TRUE,G100),TRUE)","v":0},null,30,1,"Land-, Forstwirtschaft",{"$f":"VLOOKUP(G100,Berechnungsgrundlagen!$L$5:$Q$47,6,FALSE)+E100","v":30}]
[]
["Schäden bei sonstiger Flächennutzung"]
[null,"Schäden bei sonstiger Flächennutzung",{"$f":"INDIRECT(ADDRESS(H103,VLOOKUP(G103,Berechnungsgrundlagen!$L$5:$O$47,3,FALSE)+(F103-1)+((HQ100_Nr-1)*VLOOKUP(G103,Berechnungsgrundlagen!$L$5:$O$47,4,FALSE)),1,TRUE,G103),TRUE)","v":0},null,19,1,"Sonstige Flächennutzungen",{"$f":"VLOOKUP(G103,Berechnungsgrundlagen!$L$5:$Q$47,6,FALSE)+E103","v":19}]
[]
["Schäden im Fremdenverkehr"]
[null,"Schäden im Fremdenverkehr",{"$f":"INDIRECT(ADDRESS(H106,VLOOKUP(G106,Berechnungsgrundlagen!$L$5:$O$47,3,FALSE)+(F106-1)+((HQ100_Nr-1)*VLOOKUP(G106,Berechnungsgrundlagen!$L$5:$O$47,4,FALSE)),1,TRUE,G106),TRUE)","v":0},null,18,1,"Fremdenverkehr",{"$f":"VLOOKUP(G106,Berechnungsgrundlagen!$L$5:$Q$47,6,FALSE)+E106","v":18}]
[]
[]
[null,"Wohngebäude ",{"$f":"INDIRECT(ADDRESS(H109,VLOOKUP(G109,Berechnungsgrundlagen!$L$5:$O$47,3,FALSE)+(F109-1)+((HQ100_Nr-1)*VLOOKUP(G109,Berechnungsgrundlagen!$L$5:$O$47,4,FALSE)),1,TRUE,G109),TRUE)","v":0},null,6,1,"Summe monetär bewertete Schäden",{"$f":"VLOOKUP(G109,Berechnungsgrundlagen!$L$5:$Q$47,6,FALSE)+E109","v":6}]
[null,"Nicht-Wohngebäude + Öffentliche Gebäude",{"$f":"INDIRECT(ADDRESS(H110,VLOOKUP(G110,Berechnungsgrundlagen!$L$5:$O$47,3,FALSE)+(F110-1)+((HQ100_Nr-1)*VLOOKUP(G110,Berechnungsgrundlagen!$L$5:$O$47,4,FALSE)),1,TRUE,G110),TRUE)","v":0},null,7,1,"Summe monetär bewertete Schäden",{"$f":"VLOOKUP(G110,Berechnungsgrundlagen!$L$5:$Q$47,6,FALSE)+E110","v":7}]
[null,"Verkehrs-, Ver- sowie Entsorgungsinfrastruktur",{"$f":"INDIRECT(ADDRESS(H111,VLOOKUP(G111,Berechnungsgrundlagen!$L$5:$O$47,3,FALSE)+(F111-1)+((HQ100_Nr-1)*VLOOKUP(G111,Berechnungsgrundlagen!$L$5:$O$47,4,FALSE)),1,TRUE,G111),TRUE)","v":0},null,8,1,"Summe monetär bewertete Schäden",{"$f":"VLOOKUP(G111,Berechnungsgrundlagen!$L$5:$Q$47,6,FALSE)+E111","v":8}]
[null,"Wasserbauliche Anlagen und Gewässer",{"$f":"INDIRECT(ADDRESS(H112,VLOOKUP(G112,Berechnungsgrundlagen!$L$5:$O$47,3,FALSE)+(F112-1)+((HQ100_Nr-1)*VLOOKUP(G112,Berechnungsgrundlagen!$L$5:$O$47,4,FALSE)),1,TRUE,G112),TRUE)","v":0},null,9,1,"Summe monetär bewertete Schäden",{"$f":"VLOOKUP(G112,Berechnungsgrundlagen!$L$5:$Q$47,6,FALSE)+E112","v":9}]
[null,"Land- und forstwirtschaftliche Flächen",{"$f":"INDIRECT(ADDRESS(H113,VLOOKUP(G113,Berechnungsgrundlagen!$L$5:$O$47,3,FALSE)+(F113-1)+((HQ100_Nr-1)*VLOOKUP(G113,Berechnungsgrundlagen!$L$5:$O$47,4,FALSE)),1,TRUE,G113),TRUE)","v":0},null,10,1,"Summe monetär bewertete Schäden",{"$f":"VLOOKUP(G113,Berechnungsgrundlagen!$L$5:$Q$47,6,FALSE)+E113","v":10}]
[null,"Sonstige Flächennutzungen",{"$f":"INDIRECT(ADDRESS(H114,VLOOKUP(G114,Berechnungsgrundlagen!$L$5:$O$47,3,FALSE)+(F114-1)+((HQ100_Nr-1)*VLOOKUP(G114,Berechnungsgrundlagen!$L$5:$O$47,4,FALSE)),1,TRUE,G114),TRUE)","v":0},null,11,1,"Summe monetär bewertete Schäden",{"$f":"VLOOKUP(G114,Berechnungsgrundlagen!$L$5:$Q$47,6,FALSE)+E114","v":11}]
[null,"Summe der Vermögensschäden",{"$f":"INDIRECT(ADDRESS(H115,VLOOKUP(G115,Berechnungsgrundlagen!$L$5:$O$47,3,FALSE)+(F115-1)+((HQ100_Nr-1)*VLOOKUP(G115,Berechnungsgrundlagen!$L$5:$O$47,4,FALSE)),1,TRUE,G115),TRUE)","v":0},null,12,1,"Summe monetär bewertete Schäden",{"$f":"VLOOKUP(G115,Berechnungsgrundlagen!$L$5:$Q$47,6,FALSE)+E115","v":12}]
[null,"Wertschöpfungsverluste Gewerbe und Industrie",{"$f":"INDIRECT(ADDRESS(H116,VLOOKUP(G116,Berechnungsgrundlagen!$L$5:$O$47,3,FALSE)+(F116-1)+((HQ100_Nr-1)*VLOOKUP(G116,Berechnungsgrundlagen!$L$5:$O$47,4,FALSE)),1,TRUE,G116),TRUE)","v":0},null,13,1,"Summe monetär bewertete Schäden",{"$f":"VLOOKUP(G116,Berechnungsgrundlagen!$L$5:$Q$47,6,FALSE)+E116","v":13}]
[null,"Zusätzliche Wertschöpfungsverluste im Fremdenverkehr ",{"$f":"INDIRECT(ADDRESS(H117,VLOOKUP(G117,Berechnungsgrundlagen!$L$5:$O$47,3,FALSE)+(F117-1)+((HQ100_Nr-1)*VLOOKUP(G117,Berechnungsgrundlagen!$L$5:$O$47,4,FALSE)),1,TRUE,G117),TRUE)","v":0},null,14,1,"Summe monetär bewertete Schäden",{"$f":"VLOOKUP(G117,Berechnungsgrundlagen!$L$5:$Q$47,6,FALSE)+E117","v":14}]
[null,"Summe der Wertschöpfungsverluste",{"$f":"INDIRECT(ADDRESS(H118,VLOOKUP(G118,Berechnungsgrundlagen!$L$5:$O$47,3,FALSE)+(F118-1)+((HQ100_Nr-1)*VLOOKUP(G118,Berechnungsgrundlagen!$L$5:$O$47,4,FALSE)),1,TRUE,G118),TRUE)","v":0},null,15,1,"Summe monetär bewertete Schäden",{"$f":"VLOOKUP(G118,Berechnungsgrundlagen!$L$5:$Q$47,6,FALSE)+E118","v":15}]
[null,"Katastrophenschutz - Aufwand für HW-Einsatz",{"$f":"INDIRECT(ADDRESS(H119,VLOOKUP(G119,Berechnungsgrundlagen!$L$5:$O$47,3,FALSE)+(F119-1)+((HQ100_Nr-1)*VLOOKUP(G119,Berechnungsgrundlagen!$L$5:$O$47,4,FALSE)),1,TRUE,G119),TRUE)","v":0},null,16,1,"Summe monetär bewertete Schäden",{"$f":"VLOOKUP(G119,Berechnungsgrundlagen!$L$5:$Q$47,6,FALSE)+E119","v":16}]
[]
[null,"Summe der monetär bewerteten Schäden",{"$f":"INDIRECT(ADDRESS(H121,VLOOKUP(G121,Berechnungsgrundlagen!$L$5:$O$47,3,FALSE)+(F121-1)+((HQ100_Nr-1)*VLOOKUP(G121,Berechnungsgrundlagen!$L$5:$O$47,4,FALSE)),1,TRUE,G121),TRUE)","v":0},null,18,1,"Summe monetär bewertete Schäden",{"$f":"VLOOKUP(G121,Berechnungsgrundlagen!$L$5:$Q$47,6,FALSE)+E121","v":18}]
[]
[]
[null,"Anteil des Schadens bei Wohngebäuden für BHQ [%]",{"$f":"IF($C$121<>0,C109/$C$121,0)","v":0}]
[null,"Anteil des Schadens bei Nicht-Wohngebäuden und öffentlichen Gebäuden für BHQ [%]",0]
[null,"Anteil des Schadens bei Verkehrs-, Ver- sowie Entsorgungsinfrastruktur für BHQ [%]",0]
[null,"Anteil des Schadens bei wasserbaulichen Anlagen und am Gewässer für BHQ [%]",0]
[null,"Anteil des Schadens bei Land- und forstwirtschaftliche Flächen für BHQ [%]",0]
[null,"Anteil des Schadens bei sonstige Flächennutzungen für BHQ [%]",0]
[null,"Anteil der Wertschöpfungsverluste bei Gewerbe und Industrie für BHQ [%]",{"$f":"IF($C$121<>0,C116/$C$121,0)","v":0}]
[null,"Anteil der zusätzlichen Wertschöpfungsverluste im Fremdenverkehr für BHQ [%]",{"$f":"IF($C$121<>0,C117/$C$121,0)","v":0}]
[null,"Anteil des  Katastrophenschutz - Aufwandes für HW-Einsatz bei BHQ [%]",{"$f":"IF($C$121<>0,C119/$C$121,0)","v":0}]
[null,"Gesamt [%]",{"$f":"SUM(C124:C132)","v":0}]
[]
[]
[null,null,{"$f":"+Alternativenvergleich!B2","v":"Alternative 1"}]
[null,"NAME",{"$f":"+Alternativenvergleich!B3","v":"Name Alternative 1"}]
[null,"TEILBILANZ 1"]
[null,"Barwert der Herstellungskosten",{"$f":"+Alternativenvergleich!C5","v":0}]
[null,"Barwert der Reinvestitionskosten",{"$f":"+Alternativenvergleich!C6","v":0}]
[null,"Barwert der Instandhaltungskosten",{"$f":"+Alternativenvergleich!C7","v":0}]
[null,"Projektkostenbarwert",{"$f":"+Alternativenvergleich!C8","v":0}]
[null,"Projektnutzenbarwert",{"$f":"+Alternativenvergleich!C9","v":0}]
[null,"Kapitalwert KW",{"$f":"+Alternativenvergleich!C10","v":0}]
[null,"Nutzen-Kosten-Verhältnis NKV",{"$f":"+Alternativenvergleich!C11","v":0}]
[]
[null,"TEILBILANZ 2"]
[null,"Beurteilung der Personengefährdung",{"$f":"Alternativenvergleich!B14&\" \"&Alternativenvergleich!C14","v":"0 0"}]
[null,"Monetär nicht bewertete oder nicht bewertbare ökonomische Nutzen ",{"$f":"Alternativenvergleich!B15&\" \"&Alternativenvergleich!C15","v":"0 0"}]
[null,"Außerökonomische soziokulturelle Effekte",{"$f":"Alternativenvergleich!B16&\" \"&Alternativenvergleich!C16","v":"0 0"}]
[null,"Ökologische Aspekte",{"$f":"Alternativenvergleich!B17&\" \"&Alternativenvergleich!C17","v":"0 0"}]
[null,"Ergebnis Teilbilanz 2",{"$f":"Alternativenvergleich!B18&\" \"&Alternativenvergleich!C18","v":"0 0"}]
[]
[null,"GESAMTBEURTEILUNG",{"$f":"+Alternativenvergleich!B20","v":0}]
[]
[]
[null,"Anzahl der gefilterten Werte",{"$f":"COUNTA(C3:C154)","v":100}]