{"text_format":"1","workbook":"xlsx","n_sheets":12,"sheets":["Beurteilungsnachweis","gefahrenrelevante Eigenschaften","Probenahmeplan","Probenahmeprotokoll","Analysenergebnisse","Berechnung d. Beurteilungswerte","Einhaltung der Grenzwerte","Info zur Benutzung des Makros","Recycling-Index","Tabelle1","RECHNEN","AUTO"],"not_rendered":{"charts":0,"images":6,"macros":1,"external_links":0,"defined_names":22,"comments":0,"pivot_tables":0},"unopened":[],"bounds":{"document_bytes":16777216,"sheet_cells":100000,"rows_first":2000,"rows_last":500,"rows_between":2000,"halvings":0,"cell_chars":16384,"cell_head_chars":4096},"cells_cut":0,"cells_raw":0,"read":"whole","date_system":"1900"}

{"sheet":"Beurteilungsnachweis","index":0,"n_rows":136,"n_cols":14,"rows_kept":136,"cut":false,"hidden":false,"merged":[[54,4,54,13],[22,4,22,6],[23,4,23,13],[110,0,110,13],[27,10,27,11],[101,0,101,13],[24,4,24,13],[59,4,59,13],[60,4,60,9],[61,4,61,9],[62,4,62,13],[63,4,63,13],[67,4,67,13],[42,0,42,13],[34,4,34,9],[35,4,35,9],[118,0,118,13],[122,0,122,13],[125,1,125,5],[125,11,125,13],[7,1,7,7],[18,1,18,6],[18,7,18,12],[32,4,32,13],[33,4,33,13],[17,1,17,10],[17,11,17,13],[31,4,31,13],[14,0,14,13],[20,7,20,12],[8,1,8,7],[10,1,10,7],[11,1,11,7],[12,1,12,7],[9,1,9,7],[20,1,20,6],[36,4,36,8],[36,10,36,13],[37,4,37,13],[38,4,38,13],[53,4,53,9],[49,4,49,13],[50,4,50,13],[51,4,51,13],[52,4,52,9],[69,4,69,13],[70,4,70,13],[71,9,71,13],[72,4,72,13],[73,5,73,13],[89,4,89,13],[94,10,94,11],[95,10,95,11],[84,6,84,13],[74,4,74,13],[76,4,76,13],[77,4,77,13],[78,4,78,13],[81,4,81,13]]}
[]
[]
[]
[]
[]
[]
[]
["Ergeht an:",null,null,null,null,null,null,null,null,null,null,"Datum:"]
[null,null,null,null,null,null,null,null,null,null,null,"Gültig bis:"]
[]
[]
[]
[]
[]
["Beurteilungsnachweis für einen festen Ersatzbrennstoff\ngem. Abfallverbrennungsverordnung 2024"]
[]
[]
["Kennung:"]
[]
["Kennungen vorangegangener Beurteilungsnachweise dieses Abfalls:"]
[]
["Abfallart gemäß Anhang 1 Abfallverzeichnisverordnung 2020 idgF"]
[null,"Abfallart:",null,null,null,null,null,null,"Spezifizierung:",null,null,null,"gefährlich"]
[null,"Bezeichnung:"]
[null,"Spezifizierung (in Worten):"]
[]
[]
["Gesamtmenge d. Abfalls bzw. voraussichtliche jährliche Abfallmenge:",null,null,null,null,null,null,null,null,null,null,null,null,"t"]
[]
["Angaben zum Unternehmen, welches den Beurteilungsnachweis ERSTELLT"]
[]
[null,"Firmenname:"]
[null,"Personen GLN:"]
[null,"Land:"]
[null,"Ort:",null,null,null,null,null,null,null,null,null,"Postleitzahl:"]
[null,"Strasse:",null,null,null,null,null,null,null,null,null,"Hausnummer:"]
[null,"Telefon:"]
[null,"E-Mail:"]
[null,"Kontaktperson:"]
[]
["1. Allgemeines"]
[]
["[Textfeld]"]
[]
["2. Angaben zum Abfall"]
[]
["2.1 Angaben zum Abfallbesitzer"]
["Ident mit Ersteller",null,null,null,null,null,null,null,null,null,"Ja"]
["Falls nicht:"]
[null,"Firmenname:"]
[null,"Personen GLN:"]
[null,"Land:"]
[null,"Ort:",null,null,null,null,null,null,null,null,null,"Postleitzahl:"]
[null,"Strasse:",null,null,null,null,null,null,null,null,null,"Hausnummer:"]
[null,"Kontaktperson:"]
[]
[]
["2.2 Herkunft gem. Abfallbilanzverordnung, BGBl. II Nr. 497/2008"]
["Ident mit Adresse des Abfallbesitzers:",null,null,null,null,null,null,null,null,null,"Ja"]
[null,"Land:"]
[null,"Ort:",null,null,null,null,null,null,null,null,null,"Postleitzahl:"]
[null,"Strasse:",null,null,null,null,null,null,null,null,null,"Hausnummer:"]
[null,"Standort-GLN:"]
[null,"Name des Standortes:"]
[]
["2.3 Entstehung des Abfalls"]
["Beschreibung der Entstehung des Abfalls und allfällige Behandlungsschritte:"]
[]
[]
[]
[]
["Inputmaterialien des Prozesses, bei dem der Abfall anfällt:"]
[]
["Outputmaterialien der Behandlung:"]
[]
["Angabe einer allfälligen Kontamination und deren Ursache:"]
[]
[]
[]
[]
["2.4 Beschreibung des Abfalls (bei gefährlichen Abfällen siehe auch entsprechenden Anhang )"]
[null,"Farbe:"]
[]
[null,"Geruch:",null,null,"ohne",null,null,null,"schwach",null,null,"intensiv"]
[null,null,null,null,"nach:"]
[]
[null,"Homogenität:",null,null,"homogen",null,null,null,null,"oder heterogen hinsichtlich",null,"Korngröße"]
[null,null,null,null,null,null,null,null,null,null,null,"Farbe"]
[null,null,null,null,null,null,null,null,null,null,null,"Bestandteile"]
["Anmerkung zur Homogenität:"]
[]
[null,"Konsistenz:",null,null,"staubend / pulvrig",null,null,null,"fest - trocken",null,null,"fest - feucht"]
[null,null,null,null,"pastös",null,null,null,"schlammig"]
[]
[null,"Schüttdichte:",null,null,null,null,null,null,null,null,null,null,null,"kg/m3"]
["Korngröße (Größtkorn, 95% Perzentil):",null,null,null,null,null,null,null,null,null,null,null,null,"mm"]
[]
[]
[]
["3. Probenahme"]
[]
["Es erfolgte keine Probenahme, da es sich um Materialien gem. AVV, Anhang 8, Kapitel 2.6 handelt, bei denen keine analytischen Untersuchungen erforderlich sind.  "]
[null,null,null,null,null,null,null,null,null,"zutreffend"]
[]
["Probenahmeplan und Probenahmeprotokolle siehe Anhang X"]
[]
["4. Angaben zu den Untersuchungen"]
[]
["Allgemeines"]
["[Textfeld]"]
["Die angewendeten Probenvorbereitungs-, Aufschluss-, und Analysenmethoden sind in Anhang X aufgelistet."]
[]
["Analysenergebnisse und Beurteilungswerte siehe Anhang X."]
[]
[]
["5. Beurteilung"]
[]
["Beurteilung der Eignung des Abfalls für die Verbrennung in Mitverbrennungsanlagen"]
["[Textfeld]"]
[]
["6. Vorgaben für die Untersuchung des nächsten Loses"]
[]
["[Textfeld]"]
[]
[]
["Unterschrift:",null,null,null,null,null,null,null,null,null,"Datum:"]
[]
[]
["Liste der Anhänge"]
[null,null,null,null,null,null,null,null,null,null,null,null,null,"Anzahl der Seiten"]
["Anhang",1]
["Anhang",2]
["Anhang",3]
["Anhang",4]
["Anhang","…"]
["Anhang","…"]

{"sheet":"gefahrenrelevante Eigenschaften","index":1,"n_rows":31,"n_cols":13,"rows_kept":31,"cut":false,"hidden":false,"merged":[[0,0,0,14],[38,5,38,14],[21,1,21,14],[23,1,23,14],[25,1,25,14],[27,1,27,14]]}
["Folgende gefahrenrelevante Eigenschaften sind erfüllt und der Abfall daher gefährlich"]
["(gemäß Anhang 3 Abfallverzeichnisverordnung 2020 idgF.) "]
["1.","explosiv (HP 1)",null,null,null,null,null,null,null,"nicht erfüllt",null,null,"erfüllt"]
["2.","brandfördernd (HP 2)",null,null,null,null,null,null,null,"nicht erfüllt",null,null,"erfüllt"]
["3.","entzündbar (HP 3)",null,null,null,null,null,null,null,"nicht erfüllt",null,null,"erfüllt"]
["4.","reizend – Hautreizung und Augenschädigung (HP 4)",null,null,null,null,null,null,null,"nicht erfüllt",null,null,"erfüllt"]
["5.","spezifische Zielorgan-"]
[null,"Toxizität (STOT)/Aspirationsgefahr (HP 5)",null,null,null,null,null,null,null,"nicht erfüllt",null,null,"erfüllt"]
["6.","akut toxisch (HP 6)",null,null,null,null,null,null,null,"nicht erfüllt",null,null,"erfüllt"]
["7.","karzinogen (HP 7)",null,null,null,null,null,null,null,"nicht erfüllt",null,null,"erfüllt"]
["8.","ätzend (HP 8)",null,null,null,null,null,null,null,"nicht erfüllt",null,null,"erfüllt"]
["9.","infektiös (HP 9)",null,null,null,null,null,null,null,"nicht erfüllt",null,null,"erfüllt"]
["10.","reproduktionstoxisch (HP 10)",null,null,null,null,null,null,null,"nicht erfüllt",null,null,"erfüllt"]
["11.","mutagen (HP 11)",null,null,null,null,null,null,null,"nicht erfüllt",null,null,"erfüllt"]
["12.","Freisetzung eines akut toxischen "]
[null,"Gases (HP 12)",null,null,null,null,null,null,null,"nicht erfüllt",null,null,"erfüllt"]
["13.","sensibilisierend (HP 13)",null,null,null,null,null,null,null,"nicht erfüllt",null,null,"erfüllt"]
["14.","ökotoxisch (HP 14)",null,null,null,null,null,null,null,"nicht erfüllt",null,null,"erfüllt"]
["15.","Entwicklung einer gefahrenrelevanten Eigenschaft, die ursprünglicher Abfall nicht "]
[null,"unmittelbar aufweist (HP 15) "]
[null,"Die gefahrenrelevante Eigenschaft HP15 gilt als erfüllt für: "]
[null,"– Abfälle, die einen oder mehrere Stoffe enthalten, denen einer der Gefahrenhinweise oder eine der zusätzlichen Gefahren, wie H205, EUH001, EUH019 oder EUH044 zugeordnet ist, es sei denn der Abfall liegt in einer Form vor, die unter keinen Umständen explosive oder potenziell explosive Eigenschaften zeigt. "]
[null,null,null,null,null,null,null,null,null,"nicht erfüllt",null,null,"erfüllt"]
[null,"– Abfälle, deren Gesamtgehalt an Schadstoffen die Grenzwerte gemäß  I. Gehalte anorganisch (Königswasserauszug) oder gemäß II. Gehalte organisch der Abfallverzeichnisverordnung 2020 idgF übersteigen."]
[null,null,null,null,null,null,null,null,null,"nicht erfüllt",null,null,"erfüllt"]
[null,"– Abfälle, deren Eluat die Grenzwerte gemäß III. A Abfallverzeichnisverordnung 2020 idgF übersteigen."]
[null,null,null,null,null,null,null,null,null,"nicht erfüllt",null,null,"erfüllt"]
[null,"– Abfälle, deren Gehalte an persistenten organischen Schadstoffen (POP) die gemäß Abfallverzeichnisverordnung 2020 idgF jeweils angegebenen Grenzwerte überschreiten."]
[null,null,null,null,null,null,null,null,null,"nicht erfüllt",null,null,"erfüllt"]
[]
["weitere Kenngrößen (soweit zielführend)"]

{"sheet":"Probenahmeplan","index":2,"n_rows":89,"n_cols":15,"rows_kept":89,"cut":false,"hidden":false,"merged":[[87,3,87,9],[87,11,87,14],[88,3,88,9],[74,0,74,14],[77,0,77,14],[78,0,78,14],[81,4,81,14],[82,4,82,14],[83,4,83,14],[1,4,1,14],[84,4,84,14],[73,0,73,14],[34,4,34,14],[39,11,39,14],[41,0,41,14],[42,0,42,14],[53,7,53,8],[69,0,69,14],[70,0,70,14],[17,4,17,10],[17,11,17,12],[17,13,17,14],[18,4,18,8],[18,11,18,14],[19,4,19,14],[29,11,29,14],[58,3,58,5],[67,0,67,14],[68,0,68,14],[51,3,51,4],[23,4,23,7],[23,11,23,13],[24,4,24,7],[25,4,25,14],[26,4,26,14],[14,4,14,14],[15,4,15,14],[6,4,6,10],[6,13,6,14],[16,4,16,10],[16,13,16,14],[7,4,7,10],[7,13,7,14],[8,4,8,14],[9,4,9,8],[9,11,9,14],[10,4,10,8],[10,11,10,14],[11,4,11,8],[3,4,3,14],[4,4,4,14],[5,4,5,14],[11,11,11,14],[12,4,12,14]]}
["Allgemeine Angaben"]
["Kennung des Probenahmeplans:"]
[]
[null,"Durchführende Firma:"]
[null,"Personen GLN:"]
[null,"Land:"]
[null,"Ort:",null,null,null,null,null,null,null,null,null,null,"Postleitzahl:"]
[null,"Strasse:",null,null,null,null,null,null,null,null,null,null,"Hausnummer:"]
[null,"E-Mail:"]
[null,"Projektleiter:",null,null,null,null,null,null,null,null,"Telefon:"]
[null,"Ersteller des PN-Plans:",null,null,null,null,null,null,null,null,"Telefon:"]
[null,"Probenehmer:",null,null,null,null,null,null,null,null,"Telefon:"]
[null,"Datum der Probenahme:"]
["Ort der Probenahme"]
[null,"Standort/Anlagen-GLN:"]
[null,"Land:"]
[null,"Ort:",null,null,null,null,null,null,null,null,null,null,"Postleitzahl:"]
[null,"Strasse:",null,null,null,null,null,null,null,null,null,"Hausnummer:"]
[null,"Kontakt vor Ort:",null,null,null,null,null,null,null,null,"Telefon:"]
[null,"Weitere beteiligte Parteien:"]
[]
["Angaben zum Abfall"]
["Gesamtmenge des Abfalls"]
["bzw. Jahresanfallsmenge:",null,null,null,null,null,null,null,"t",null,"Losumfang: ",null,null,null,"t"]
[null,"Abfallart:",null,null,null,null,null,null,null,null,"Spezifizierung:",null,null,"gefährlich"]
[null,"Bezeichnung:"]
[null,"Spezifizierung (in Worten):"]
[null,"Untersuchung für:",null,null,null,null,"1. Los",null,null,null,null,"ab dem 2. Los"]
[null,"Form:",null,null,null,null,"Fluff",null,null,"Pellets",null,"Ballen",null,"Pulver"]
[null,null,null,null,null,null,"pastöser Abfall",null,null,null,"sonstiges:"]
[null,"Form der Teilchen:",null,null,null,null,"Blättchen",null,null,null,null,null,"Granulat"]
[null,"Schüttdichte:",null,null,null,null,null,null,null,null,null,null,150,"kg/m3"]
[null,"Teilchendichte:",null,null,null,null,null,null,null,null,null,null,1,"g/cm3"]
["Korngröße (Größtkorn, 95% Perzentil):",null,null,null,null,null,null,null,null,null,null,null,40,"mm"]
[null,"Sonstiges:"]
[]
["Grundangaben zur Probenahme"]
["Probenahmeverfahren:",null,null,null,null,null,null,null,null,"mechanisch",null,null,"manuell"]
["erfolgt aus/von:",null,null,null,null,"Outputstrom",null,null,null,"Förderband",null,null,"Fahrzeug"]
[null,null,null,null,null,"Haufwerk",null,null,null,"sonstiges:"]
["Identifizierung von Zugangsproblemen, die das Probenahmeverfahren beeinträchtigen könnten:"]
[]
[]
[]
["Berechnung der Mindestmenge einer qualifizierten Stichprobe"]
["(nach ÖNORM EN ISO 21645)"]
[]
[]
["für die Berechnung werden folgende Werte herangezogen"]
["Größtkorn (d95)",null,null,null,{"$f":"$M$34","v":40},"mm",null,null,"Verteilungsfaktor (g)",null,null,null,1]
["Formfaktor (f)",null,null,null,1,"mm3/mm3",null,null,"Faktor (p)",null,null,null,0.1]
["Partikeldichte (λp)",null,null,{"$f":"M33/1000","v":1E-3},null,"g/mm3",null,null,"Variationskoeffizient (CV)",null,null,null,0.1]
[]
["Mindestmenge der QSTP (mQSTP)",null,null,null,null,null,null,{"$f":"PI()/6*POWER(E50,3)*E51*D52*M50*(1-M51)/SUMSQ(M52)/M51","v":30159.289474462006},null,"g",{"$f":"H54/1000","v":30.159289474462007},"kg",{"$f":"K54/$M$32*1000","v":201.0619298297467},"l"]
[]
["Berechnung der Mindestmenge einer Stichprobe  (nach ÖNORM EN ISO 21645)"]
[]
["für die Berechnung werden folgende Werte herangezogen"]
["Schüttdichte (λb):",null,null,{"$f":"M32","v":150},null,null,"kg/m3",null,"Größtkorn (d95):",null,null,{"$f":"$M$34","v":40},"mm"]
["resultierende Mindestmenge der Stichprobe (mSTP):",null,null,null,null,null,null,null,null,null,null,{"$f":"0.000000027*POWER(L59,3)*D59","v":0.25919999999999999},"kg",{"$f":"L60/$M$32*1000","v":1.728},"l"]
[]
["Festlegung der effektiven Mengen"]
["Anzahl an Stichproben pro qualifizierter Stichprobe"]
["effektive Menge der Stichproben",null,null,null,null,null,null,null,null,null,null,null,"kg",{"$f":"L64/$M$32*1000","v":0},"l"]
["effektive Menge der qualifizierten Stichproben",null,null,null,null,null,null,null,null,null,null,null,"kg",{"$f":"L65/$M$32*1000","v":0},"l"]
[]
["Vorgaben für die Probenahme"]
[]
[]
[]
[]
[]
["Vorgaben für Verpackung, Konservierung, Transport und Aufbewahrung"]
[]
[]
[]
["Sicherheitsvorkehrungen"]
[]
[]
[]
["Liste der Anhänge"]
[null,null,"1."]
[null,null,"2."]
[null,null,"3."]
[null,null,"…"]
[]
[null,null,null,"Unterschrift",null,null,null,null,null,null,null,"Datum"]
[null,null,"Projektleiter:"]
[null,null,"Ersteller des PN-Plans:"]

{"sheet":"Probenahmeprotokoll","index":3,"n_rows":33,"n_cols":7,"rows_kept":33,"cut":false,"hidden":false,"merged":[[2,0,2,6],[3,0,3,6],[4,0,4,6],[5,0,5,6],[30,2,30,5],[27,2,27,5],[28,2,28,5],[29,2,29,5]]}
[]
["Abweichungen hinsichtlich der geplanten Vorgehensweise"]
[]
[]
[]
[]
[]
["Übersicht über die hergestellten qualifizierten Stichproben"]
["eindeutige Kennung der qualifizierten Stichprobe","Anzahl der Stichproben","Datum/Zeit","eindeutige Zuordnung zu Los, Teilmenge, Fahrzeugnummer, Gefäßnummer oder ähnliche Angabe","Menge/Einheit","Anmerkungen","Unterschrift (Paraphe)"]
[]
[]
[]
[]
[]
[]
[]
[]
[]
[]
[]
[]
[]
[]
[]
[]
[]
["Liste der Anhänge"]
[null,"1."]
[null,"2."]
[null,"3."]
[null,"…"]
[]
[null,null,"Unterschrift des Probenehmers: ",null,"Datum: "]

{"sheet":"Analysenergebnisse","index":4,"n_rows":5000,"n_cols":56,"rows_kept":5000,"cut":false,"hidden":false,"merged":[[0,0,2,0],[0,1,2,1]]}
["Probenbezeichnung","Beurteilungsnachweis (Kennung)                     ","Hu","Sb","As","Pb","Cd","Cr","Co","Ni","Hg","Chlor","Parameter 10","Parameter 11","Parameter 12","Parameter 13","Parameter 14","Parameter 15","Parameter 16","Parameter 17","Parameter 18","Parameter 19","Parameter 20","Parameter 21","Parameter 22","Parameter 23","Parameter 24","Parameter 25","Parameter 26","Parameter 27","Parameter 28","Parameter 29","Parameter 30","Parameter 31","Parameter 32","Parameter 33","Parameter 34","Parameter 35","Parameter 36","Parameter 37","Parameter 38","Parameter 39","Parameter 40","Parameter 41","Parameter 42","Parameter 43","Parameter 44","Parameter 45","Parameter 46","Parameter 47","Parameter 48","Parameter 49","Parameter 50",null,"Auswahl Hu","Auswahl Elemente"]
[null,null,"MJ/kg TM","mg/kg TM","mg/kg TM","mg/kg TM","mg/kg TM","mg/kg TM","mg/kg TM","mg/kg TM","mg/kg TM","mg/kg TM","mg/kg TM","mg/kg TM","mg/kg TM","mg/kg TM","mg/kg TM","mg/kg TM","mg/kg TM","mg/kg TM","mg/kg TM","mg/kg TM","mg/kg TM","mg/kg TM","mg/kg TM","mg/kg TM","mg/kg TM","mg/kg TM","mg/kg TM","mg/kg TM","mg/kg TM","mg/kg TM","mg/kg TM","mg/kg TM","mg/kg TM","mg/kg TM","mg/kg TM","mg/kg TM","mg/kg TM","mg/kg TM","mg/kg TM","mg/kg TM","mg/kg TM","mg/kg TM","mg/kg TM","mg/kg TM","mg/kg TM","mg/kg TM","mg/kg TM","mg/kg TM","mg/kg TM","mg/kg TM","mg/kg TM",null,"MJ/kg TM","mg/kg TM"]
[null,null,null,null,null,null,null,null,null,null,null,null,null,null,null,null,null,null,null,null,null,null,null,null,null,null,null,null,null,null,null,null,null,null,null,null,null,null,null,null,null,null,null,null,null,null,null,null,null,null,null,null,null,null,"MJ/kg","mg/kg"]
[]
[]
[null,null,null,null,null,null,null,null,null,null,null,null,null,null,null,null,null,null,null,null,null,null,null,null,null,null,null,null,null,null,null,null,null,null,null,null,null,null,null,null,null,null,null,null,null,null,null,null,null,null,null,null,null,null,null,"% TM"]
[null,null,null,null,null,null,null,null,null,null,null,null,null,null,null,null,null,null,null,null,null,null,null,null,null,null,null,null,null,null,null,null,null,null,null,null,null,null,null,null,null,null,null,null,null,null,null,null,null,null,null,null,null,null,null,"%"]
[]
[]
[]
[]
[]
[]
[]
[]
[]
[]
[]
[]
[]
[]
[]
[]
[]
[]
[]
[]
[]
[]
[]
[]
[]
[]
[]
[]
[]
[]
[]
[]
[]
[]
[]
[]
[]
[]
[]
[]
[]
[]
[]
[]
[]
[]
[]
[]
[]
[]
[]
[]
[]
[]
[]
[]
[]
[]
[]
[]
[]
[]
[]
[]
[]
[]
[]
[]
[]
[]
[]
[]
[]
[]
[]
[]
[]
[]
[]
[]
[]
[]
[]
[]
[]
[]
[]
[]
[]
[]
[]
[]
[]
[]
[]
[]
[]
[]
[]
[]
[]
[]
[]
[]
[]
[]
[]
[]
[]
[]
[]
[]
[]
[]
[]
[]
[]
[]
[]
[]
[]
[]
[]
[]
[]
[]
[]
[]
[]
[]
[]
[]
[]
[]
[]
[]
[]
[]
[]
[]
[]
[]
[]
[]
[]
[]
[]
[]
[]
[]
[]
[]
[]
[]
[]
[]
[]
[]
[]
[]
[]
[]
[]
[]
[]
[]
[]
[]
[]
[]
[]
[]
[]
[]
[]
[]
[]
[]
[]
[]
[]
[]
[]
[]
[]
[]
[]
[]
[]
[]
[]
[]
[]
[]
[]
[]
[]
[]
[]
[]
[]
[]
[]
[]
[]
[]
[]
[]
[]
[]
[]
[]
[]
[]
[]
[]
[]
[]
[]
[]
[]
[]
[]
[]
[]
[]
[]
[]
[]
[]
[]
[]
[]
[]
[]
[]
[]
[]
[]
[]
[]
[]
[]
[]
[]
[]
[]
[]
[]
[]
[]
[]
[]
[]
[]
[]
[]
[]
[]
[]
[]
[]
[]
[]
[]
[]
[]
[]
[]
[]
[]
[]
[]
[]
[]
[]
[]
[]
[]
[]
[]
[]
[]
[]
[]
[]
[]
[]
[]
[]
[]
[]
[]
[]
[]
[]
[]
[]
[]
[]
[]
[]
[]
[]
[]
[]
[]
[]
[]
[]
[]
[]
[]
[]
[]
[]
[]
[]
[]
[]
[]
[]
[]
[]
[]
[]
[]
[]
[]
[]
[]
[]
[]
[]
[]
[]
[]
[]
[]
[]
[]
[]
[]
[]
[]
[]
[]
[]
[]
[]
[]
[]
[]
[]
[]
[]
[]
[]
[]
[]
[]
[]
[]
[]
[]
[]
[]
[]
[]
[]
[]
[]
[]
[]
[]
[]
[]
[]
[]
[]
[]
[]
[]
[]
[]
[]
[]
[]
[]
[]
[]
[]
[]
[]
[]
[]
[]
[]
[]
[]
[]
[]
[]
[]
[]
[]
[]
[]
[]
[]
[]
[]
[]
[]
[]
[]
[]
[]
[]
[]
[]
[]
[]
[]
[]
[]
[]
[]
[]
[]
[]
[]
[]
[]
[]
[]
[]
[]
[]
[]
[]
[]
[]
[]
[]
[]
[]
[]
[]
[]
[]
[]
[]
[]
[]
[]
[]
[]
[]
[]
[]
[]
[]
[]
[]
[]
[]
[]
[]
[]
[]
[]
[]
[]
[]
[]
[]
[]
[]
[]
[]
[]
[]
[]
[]
[]
[]
[]
[]
[]
[]
[]
[]
[]
[]
[]
[]
[]
[]
[]
[]
[]
[]
[]
[]
[]
[]
[]
[]
[]
[]
[]
[]
[]
[]
[]
[]
[]
[]
[]
[]
[]
[]
[]
[]
[]
[]
[]
[]
[]
[]
[]
[]
[]
[]
[]
[]
[]
[]
[]
[]
[]
[]
[]
[]
[]
[]
[]
[]
[]
[]
[]
[]
[]
[]
[]
[]
[]
[]
[]
[]
[]
[]
[]
[]
[]
[]
[]
[]
[]
[]
[]
[]
[]
[]
[]
[]
[]
[]
[]
[]
[]
[]
[]
[]
[]
[]
[]
[]
[]
[]
[]
[]
[]
[]
[]
[]
[]
[]
[]
[]
[]
[]
[]
[]
[]
[]
[]
[]
[]
[]
[]
[]
[]
[]
[]
[]
[]
[]
[]
[]
[]
[]
[]
[]
[]
[]
[]
[]
[]
[]
[]
[]
[]
[]
[]
[]
[]
[]
[]
[]
[]
[]
[]
[]
[]
[]
[]
[]
[]
[]
[]
[]
[]
[]
[]
[]
[]
[]
[]
[]
[]
[]
[]
[]
[]
[]
[]
[]
[]
[]
[]
[]
[]
[]
[]
[]
[]
[]
[]
[]
[]
[]
[]
[]
[]
[]
[]
[]
[]
[]
[]
[]
[]
[]
[]
[]
[]
[]
[]
[]
[]
[]
[]
[]
[]
[]
[]
[]
[]
[]
[]
[]
[]
[]
[]
[]
[]
[]
[]
[]
[]
[]
[]
[]
[]
[]
[]
[]
[]
[]
[]
[]
[]
[]
[]
[]
[]
[]
[]
[]
[]
[]
[]
[]
[]
[]
[]
[]
[]
[]
[]
[]
[]
[]
[]
[]
[]
[]
[]
[]
[]
[]
[]
[]
[]
[]
[]
[]
[]
[]
[]
[]
[]
[]
[]
[]
[]
[]
[]
[]
[]
[]
[]
[]
[]
[]
[]
[]
[]
[]
[]
[]
[]
[]
[]
[]
[]
[]
[]
[]
[]
[]
[]
[]
[]
[]
[]
[]
[]
[]
[]
[]
[]
[]
[]
[]
[]
[]
[]
[]
[]
[]
[]
[]
[]
[]
[]
[]
[]
[]
[]
[]
[]
[]
[]
[]
[]
[]
[]
[]
[]
[]
[]
[]
[]
[]
[]
[]
[]
[]
[]
[]
[]
[]
[]
[]
[]
[]
[]
[]
[]
[]
[]
[]
[]
[]
[]
[]
[]
[]
[]
[]
[]
[]
[]
[]
[]
[]
[]
[]
[]
[]
[]
[]
[]
[]
[]
[]
[]
[]
[]
[]
[]
[]
[]
[]
[]
[]
[]
[]
[]
[]
[]
[]
[]
[]
[]
[]
[]
[]
[]
[]
[]
[]
[]
[]
[]
[]
[]
[]
[]
[]
[]
[]
[]
[]
[]
[]
[]
[]
[]
[]
[]
[]
[]
[]
[]
[]
[]
[]
[]
[]
[]
[]
[]
[]
[]
[]
[]
[]
[]
[]
[]
[]
[]
[]
[]
[]
[]
[]
[]
[]
[]
[]
[]
[]
[]
[]
[]
[]
[]
[]
[]
[]
[]
[]
[]
[]
[]
[]
[]
[]
[]
[]
[]
[]
[]
[]
[]
[]
[]
[]
[]
[]
[]
[]
[]
[]
[]
[]
[]
[]
[]
[]
[]
[]
[]
[]
[]
[]
[]
[]
[]
[]
[]
[]
[]
[]
[]
[]
[]
[]
[]
[]
[]
[]
[]
[]
[]
[]
[]
[]
[]
[]
[]
[]
[]
[]
[]
[]
[]
[]
[]
[]
[]
[]
[]
[]
[]
[]
[]
[]
[]
[]
[]
[]
[]
[]
[]
[]
[]
[]
[]
[]
[]
[]
[]
[]
[]
[]
[]
[]
[]
[]
[]
[]
[]
[]
[]
[]
[]
[]
[]
[]
[]
[]
[]
[]
[]
[]
[]
[]
[]
[]
[]
[]
[]
[]
[]
[]
[]
[]
[]
[]
[]
[]
[]
[]
[]
[]
[]
[]
[]
[]
[]
[]
[]
[]
[]
[]
[]
[]
[]
[]
[]
[]
[]
[]
[]
[]
[]
[]
[]
[]
[]
[]
[]
[]
[]
[]
[]
[]
[]
[]
[]
[]
[]
[]
[]
[]
[]
[]
[]
[]
[]
[]
[]
[]
[]
[]
[]
[]
[]
[]
[]
[]
[]
[]
[]
[]
[]
[]
[]
[]
[]
[]
[]
[]
[]
[]
[]
[]
[]
[]
[]
[]
[]
[]
[]
[]
[]
[]
[]
[]
[]
[]
[]
[]
[]
[]
[]
[]
[]
[]
[]
[]
[]
[]
[]
[]
[]
[]
[]
[]
[]
[]
[]
[]
[]
[]
[]
[]
[]
[]
[]
[]
[]
[]
[]
[]
[]
[]
[]
[]
[]
[]
[]
[]
[]
[]
[]
[]
[]
[]
[]
[]
[]
[]
[]
[]
[]
[]
[]
[]
[]
[]
[]
[]
[]
[]
[]
[]
[]
[]
[]
[]
[]
[]
[]
[]
[]
[]
[]
[]
[]
[]
[]
[]
[]
[]
[]
[]
[]
[]
[]
[]
[]
[]
[]
[]
[]
[]
[]
[]
[]
[]
[]
[]
[]
[]
[]
[]
[]
[]
[]
[]
[]
[]
[]
[]
[]
[]
[]
[]
[]
[]
[]
[]
[]
[]
[]
[]
[]
[]
[]
[]
[]
[]
[]
[]
[]
[]
[]
[]
[]
[]
[]
[]
[]
[]
[]
[]
[]
[]
[]
[]
[]
[]
[]
[]
[]
[]
[]
[]
[]
[]
[]
[]
[]
[]
[]
[]
[]
[]
[]
[]
[]
[]
[]
[]
[]
[]
[]
[]
[]
[]
[]
[]
[]
[]
[]
[]
[]
[]
[]
[]
[]
[]
[]
[]
[]
[]
[]
[]
[]
[]
[]
[]
[]
[]
[]
[]
[]
[]
[]
[]
[]
[]
[]
[]
[]
[]
[]
[]
[]
[]
[]
[]
[]
[]
[]
[]
[]
[]
[]
[]
[]
[]
[]
[]
[]
[]
[]
[]
[]
[]
[]
[]
[]
[]
[]
[]
[]
[]
[]
[]
[]
[]
[]
[]
[]
[]
[]
[]
[]
[]
[]
[]
[]
[]
[]
[]
[]
[]
[]
[]
[]
[]
[]
[]
[]
[]
[]
[]
[]
[]
[]
[]
[]
[]
[]
[]
[]
[]
[]
[]
[]
[]
[]
[]
[]
[]
[]
[]
[]
[]
[]
[]
[]
[]
[]
[]
[]
[]
[]
[]
[]
[]
[]
[]
[]
[]
[]
[]
[]
[]
[]
[]
[]
[]
[]
[]
[]
[]
[]
[]
[]
[]
[]
[]
[]
[]
[]
[]
[]
[]
[]
[]
[]
[]
[]
[]
[]
[]
[]
[]
[]
[]
[]
[]
[]
[]
[]
[]
[]
[]
[]
[]
[]
[]
[]
[]
[]
[]
[]
[]
[]
[]
[]
[]
[]
[]
[]
[]
[]
[]
[]
[]
[]
[]
[]
[]
[]
[]
[]
[]
[]
[]
[]
[]
[]
[]
[]
[]
[]
[]
[]
[]
[]
[]
[]
[]
[]
[]
[]
[]
[]
[]
[]
[]
[]
[]
[]
[]
[]
[]
[]
[]
[]
[]
[]
[]
[]
[]
[]
[]
[]
[]
[]
[]
[]
[]
[]
[]
[]
[]
[]
[]
[]
[]
[]
[]
[]
[]
[]
[]
[]
[]
[]
[]
[]
[]
[]
[]
[]
[]
[]
[]
[]
[]
[]
[]
[]
[]
[]
[]
[]
[]
[]
[]
[]
[]
[]
[]
[]
[]
[]
[]
[]
[]
[]
[]
[]
[]
[]
[]
[]
[]
[]
[]
[]
[]
[]
[]
[]
[]
[]
[]
[]
[]
[]
[]
[]
[]
[]
[]
[]
[]
[]
[]
[]
[]
[]
[]
[]
[]
[]
[]
[]
[]
[]
[]
[]
[]
[]
[]
[]
[]
[]
[]
[]
[]
[]
[]
[]
[]
[]
[]
[]
[]
[]
[]
[]
[]
[]
[]
[]
[]
[]
[]
[]
[]
[]
[]
[]
[]
[]
[]
[]
[]
[]
[]
[]
[]
[]
[]
[]
[]
[]
[]
[]
[]
[]
[]
[]
[]
[]
[]
[]
[]
[]
[]
[]
[]
[]
[]
[]
[]
[]
[]
[]
[]
[]
[]
[]
[]
[]
[]
[]
[]
[]
[]
[]
[]
[]
[]
[]
[]
[]
[]
[]
[]
[]
[]
[]
[]
[]
[]
[]
[]
[]
[]
[]
[]
[]
[]
[]
[]
[]
[]
[]
[]
[]
[]
[]
[]
[]
[]
[]
[]
[]
[]
[]
[]
[]
[]
[]
[]
[]
[]
[]
[]
[]
[]
[]
[]
[]
[]
[]
[]
[]
[]
[]
[]
[]
[]
[]
[]
[]
[]
[]
[]
[]
[]
[]
[]
[]
[]
[]
[]
[]
[]
[]
[]
[]
[]
[]
[]
[]
[]
[]
[]
[]
[]
[]
[]
[]
[]
[]
[]
[]
[]
[]
[]
[]
[]
[]
[]
[]
[]
[]
[]
[]
[]
[]
[]
[]
[]
[]
[]
[]
[]
[]
[]
[]
[]
[]
[]
[]
[]
[]
[]
[]
[]
[]
[]
[]
[]
[]
[]
[]
[]
[]
[]
[]
[]
[]
[]
[]
[]
[]
[]
[]
[]
[]
[]
[]
[]
[]
[]
[]
[]
[]
[]
[]
[]
[]
[]
[]
[]
[]
[]
[]
[]
[]
[]
[]
[]
[]
[]
[]
[]
[]
[]
[]
[]
[]
[]
[]
[]
[]
[]
[]
[]
[]
[]
[]
[]
[]
[]
[]
[]
[]
[]
[]
[]
[]
[]
[]
[]
[]
[]
[]
[]
[]
[]
[]
[]
[]
[]
[]
[]
[]
[]
[]
[]
[]
[]
[]
[]
[]
[]
[]
[]
[]
[]
[]
[]
[]
[]
[]
[]
[]
[]
[]
[]
[]
[]
[]
[]
[]
[]
[]
[]
[]
[]
[]
[]
[]
[]
[]
[]
[]
[]
[]
[]
[]
[]
[]
[]
[]
[]
[]
[]
[]
[]
[]
[]
[]
[]
[]
[]
[]
[]
[]
[]
[]
[]
[]
[]
[]
[]
[]
[]
[]
[]
[]
[]
[]
[]
[]
[]
[]
[]
[]
[]
[]
[]
[]
[]
[]
[]
[]
[]
[]
[]
[]
[]
[]
[]
[]
[]
[]
[]
[]
[]
[]
[]
[]
[]
[]
[]
[]
[]
[]
[]
[]
[]
[]
[]
[]
[]
[]
[]
[]
[]
[]
[]
[]
[]
[]
[]
[]
[]
[]
[]
[]
[]
[]
[]
[]
[]
[]
[]
[]
[]
[]
[]
[]
[]
[]
[]
[]
[]
[]
[]
[]
[]
[]
[]
[]
[]
[]
[]
[]
[]
[]
[]
[]
[]
[]
[]
[]
[]
[]
[]
[]
[]
[]
[]
[]
[]
[]
[]
[]
[]
[]
[]
[]
[]
[]
[]
[]
[]
[]
[]
[]
[]
[]
[]
[]
[]
[]
[]
[]
[]
[]
[]
[]
[]
[]
[]
[]
[]
[]
[]
[]
[]
[]
[]
[]
[]
[]
[]
[]
[]
[]
[]
[]
[]
[]
[]
[]
[]
[]
[]
[]
[]
[]
[]
[]
[]
[]
[]
[]
[]
[]
[]
[]
[]
[]
[]
[]
[]
[]
[]
[]
[]
[]
[]
[]
[]
[]
[]
[]
[]
[]
[]
[]
[]
[]
[]
[]
[]
[]
[]
[]
[]
[]
[]
[]
[]
[]
[]
[]
[]
[]
[]
[]
[]
[]
[]
[]
[]
[]
[]
[]
[]
[]
[]
[]
[]
[]
[]
[]
[]
[]
[]
[]
[]
[]
[]
[]
[]
[]
[]
[]
[]
[]
[]
[]
[]
[]
[]
[]
[]
[]
[]
[]
[]
[]
[]
[]
[]
[]
[]
[]
[]
[]
[]
[]
[]
[]
[]
[]
[]
[]
[]
[]
[]
[]
[]
[]
[]
[]
[]
[]
[]
[]
[]
[]
[]
[]
[]
[]
[]
[]
[]
[]
[]
[]
[]
[]
[]
[]
[]
[]
[]
[]
[]
[]
[]
[]
[]
[]
[]
[]
[]
[]
[]
[]
[]
[]
[]
[]
[]
[]
[]
[]
[]
[]
[]
[]
[]
[]
[]
[]
[]
[]
[]
[]
[]
[]
[]
[]
[]
[]
[]
[]
[]
[]
[]
[]
[]
[]
[]
[]
[]
[]
[]
[]
[]
[]
[]
[]
[]
[]
[]
[]
[]
[]
[]
[]
[]
[]
[]
[]
[]
[]
[]
[]
[]
[]
[]
[]
[]
[]
[]
[]
[]
[]
[]
[]
[]
[]
[]
[]
[]
[]
[]
[]
[]
[]
[]
[]
[]
[]
[]
[]
[]
[]
[]
[]
[]
[]
[]
[]
[]
[]
[]
[]
[]
[]
[]
[]
[]
[]
[]
[]
[]
[]
[]
[]
[]
[]
[]
[]
[]
[]
[]
[]
[]
[]
[]
[]
[]
[]
[]
[]
[]
[]
[]
[]
[]
[]
[]
[]
[]
[]
[]
[]
[]
[]
[]
[]
[]
[]
[]
[]
[]
[]
[]
[]
[]
[]
[]
[]
[]
[]
[]
[]
[]
[]
[]
[]
[]
[]
[]
[]
[]
[]
[]
[]
[]
[]
[]
[]
[]
[]
[]
[]
[]
[]
[]
[]
[]
[]
[]
[]
[]
[]
[]
[]
[]
[]
[]
[]
[]
[]
[]
[]
[]
[]
[]
[]
[]
[]
[]
[]
[]
[]
[]
[]
[]
[]
[]
[]
[]
[]
[]
[]
[]
[]
[]
[]
[]
[]
[]
[]
[]
[]
[]
[]
[]
[]
[]
[]
[]
[]
[]
[]
[]
[]
[]
[]
[]
[]
[]
[]
[]
[]
[]
[]
[]
[]
[]
[]
[]
[]
[]
[]
[]
[]
[]
[]
[]
[]
[]
[]
[]
[]
[]
[]
[]
[]
[]
[]
[]
[]
[]
[]
[]
[]
[]
[]
[]
[]
[]
[]
[]
[]
[]
[]
[]
[]
[]
[]
[]
[]
[]
[]
[]
[]
[]
[]
[]
[]
[]
[]
[]
[]
[]
[]
[]
[]
[]
[]
[]
[]
[]
[]
[]
[]
[]
[]
[]
[]
[]
[]
[]
[]
[]
[]
[]
[]
[]
[]
[]
[]
[]
[]
[]
[]
[]
[]
[]
[]
[]
[]
[]
[]
[]
[]
[]
[]
[]
[]
[]
[]
[]
[]
[]
[]
[]
[]
[]
[]
[]
[]
[]
[]
[]
[]
[]
[]
[]
[]
[]
[]
[]
[]
[]
[]
[]
[]
[]
[]
[]
[]
[]
[]
[]
[]
[]
[]
[]
[]
[]
[]
[]
[]
[]
[]
[]
[]
[]
[]
[]
[]
[]
[]
[]
[]
[]
[]
[]
[]
[]
[]
[]
[]
[]
[]
[]
[]
[]
[]
[]
[]
[]
[]
[]
[]
[]
[]
[]
[]
[]
[]
[]
[]
[]
[]
[]
[]
[]
[]
[]
[]
[]
[]
[]
[]
[]
[]
[]
[]
[]
[]
[]
[]
[]
[]
[]
[]
[]
[]
[]
[]
[]
[]
[]
[]
[]
[]
[]
[]
[]
[]
[]
[]
[]
[]
[]
[]
[]
[]
[]
[]
[]
[]
[]
[]
[]
[]
[]
[]
[]
[]
[]
[]
[]
[]
[]
[]
[]
[]
[]
[]
[]
[]
[]
[]
[]
[]
[]
[]
[]
[]
[]
[]
[]
[]
[]
[]
[]
[]
[]
[]
[]
[]
[]
[]
[]
[]
[]
[]
[]
[]
[]
[]
[]
[]
[]
[]
[]
[]
[]
[]
[]
[]
[]
[]
[]
[]
[]
[]
[]
[]
[]
[]
[]
[]
[]
[]
[]
[]
[]
[]
[]
[]
[]
[]
[]
[]
[]
[]
[]
[]
[]
[]
[]
[]
[]
[]
[]
[]
[]
[]
[]
[]
[]
[]
[]
[]
[]
[]
[]
[]
[]
[]
[]
[]
[]
[]
[]
[]
[]
[]
[]
[]
[]
[]
[]
[]
[]
[]
[]
[]
[]
[]
[]
[]
[]
[]
[]
[]
[]
[]
[]
[]
[]
[]
[]
[]
[]
[]
[]
[]
[]
[]
[]
[]
[]
[]
[]
[]
[]
[]
[]
[]
[]
[]
[]
[]
[]
[]
[]
[]
[]
[]
[]
[]
[]
[]
[]
[]
[]
[]
[]
[]
[]
[]
[]
[]
[]
[]
[]
[]
[]
[]
[]
[]
[]
[]
[]
[]
[]
[]
[]
[]
[]
[]
[]
[]
[]
[]
[]
[]
[]
[]
[]
[]
[]
[]
[]
[]
[]
[]
[]
[]
[]
[]
[]
[]
[]
[]
[]
[]
[]
[]
[]
[]
[]
[]
[]
[]
[]
[]
[]
[]
[]
[]
[]
[]
[]
[]
[]
[]
[]
[]
[]
[]
[]
[]
[]
[]
[]
[]
[]
[]
[]
[]
[]
[]
[]
[]
[]
[]
[]
[]
[]
[]
[]
[]
[]
[]
[]
[]
[]
[]
[]
[]
[]
[]
[]
[]
[]
[]
[]
[]
[]
[]
[]
[]
[]
[]
[]
[]
[]
[]
[]
[]
[]
[]
[]
[]
[]
[]
[]
[]
[]
[]
[]
[]
[]
[]
[]
[]
[]
[]
[]
[]
[]
[]
[]
[]
[]
[]
[]
[]
[]
[]
[]
[]
[]
[]
[]
[]
[]
[]
[]
[]
[]
[]
[]
[]
[]
[]
[]
[]
[]
[]
[]
[]
[]
[]
[]
[]
[]
[]
[]
[]
[]
[]
[]
[]
[]
[]
[]
[]
[]
[]
[]
[]
[]
[]
[]
[]
[]
[]
[]
[]
[]
[]
[]
[]
[]
[]
[]
[]
[]
[]
[]
[]
[]
[]
[]
[]
[]
[]
[]
[]
[]
[]
[]
[]
[]
[]
[]
[]
[]
[]
[]
[]
[]
[]
[]
[]
[]
[]
[]
[]
[]
[]
[]
[]
[]
[]
[]
[]
[]
[]
[]
[]
[]
[]
[]
[]
[]
[]
[]
[]
[]
[]
[]
[]
[]
[]
[]
[]
[]
[]
[]
[]
[]
[]
[]
[]
[]
[]
[]
[]
[]
[]
[]
[]
[]
[]
[]
[]
[]
[]
[]
[]
[]
[]
[]
[]
[]
[]
[]
[]
[]
[]
[]
[]
[]
[]
[]
[]
[]
[]
[]
[]
[]
[]
[]
[]
[]
[]
[]
[]
[]
[]
[]
[]
[]
[]
[]
[]
[]
[]
[]
[]
[]
[]
[]
[]
[]
[]
[]
[]
[]
[]
[]
[]
[]
[]
[]
[]
[]
[]
[]
[]
[]
[]
[]
[]
[]
[]
[]
[]
[]
[]
[]
[]
[]
[]
[]
[]
[]
[]
[]
[]
[]
[]
[]
[]
[]
[]
[]
[]
[]
[]
[]
[]
[]
[]
[]
[]
[]
[]
[]
[]
[]
[]
[]
[]
[]
[]
[]
[]
[]
[]
[]
[]
[]
[]
[]
[]
[]
[]
[]
[]
[]
[]
[]
[]
[]
[]
[]
[]
[]
[]
[]
[]
[]
[]
[]
[]
[]
[]
[]
[]
[]
[]
[]
[]
[]
[]
[]
[]
[]
[]
[]
[]
[]
[]
[]
[]
[]
[]
[]
[]
[]
[]
[]
[]
[]
[]
[]
[]
[]
[]
[]
[]
[]
[]
[]
[]
[]
[]
[]
[]
[]
[]
[]
[]
[]
[]
[]
[]
[]
[]
[]
[]
[]
[]
[]
[]
[]
[]
[]
[]
[]
[]
[]
[]
[]
[]
[]
[]
[]
[]
[]
[]
[]
[]
[]
[]
[]
[]
[]
[]
[]
[]
[]
[]
[]
[]
[]
[]
[]
[]
[]
[]
[]
[]
[]
[]
[]
[]
[]
[]
[]
[]
[]
[]
[]
[]
[]
[]
[]
[]
[]
[]
[]
[]
[]
[]
[]
[]
[]
[]
[]
[]
[]
[]
[]
[]
[]
[]
[]
[]
[]
[]
[]
[]
[]
[]
[]
[]
[]
[]
[]
[]
[]
[]
[]
[]
[]
[]
[]
[]
[]
[]
[]
[]
[]
[]
[]
[]
[]
[]
[]
[]
[]
[]
[]
[]
[]
[]
[]
[]
[]
[]
[]
[]
[]
[]
[]
[]
[]
[]
[]
[]
[]
[]
[]
[]
[]
[]
[]
[]
[]
[]
[]
[]
[]
[]
[]
[]
[]
[]
[]
[]
[]
[]
[]
[]
[]
[]
[]
[]
[]
[]
[]
[]
[]
[]
[]
[]
[]
[]
[]
[]
[]
[]
[]
[]
[]
[]
[]
[]
[]
[]
[]
[]
[]
[]
[]
[]
[]
[]
[]
[]
[]
[]
[]
[]
[]
[]
[]
[]
[]
[]
[]
[]
[]
[]
[]
[]
[]
[]
[]
[]
[]
[]
[]
[]
[]
[]
[]
[]
[]
[]
[]
[]
[]
[]
[]
[]
[]
[]
[]
[]
[]
[]
[]
[]
[]
[]
[]
[]
[]
[]
[]
[]
[]
[]
[]
[]
[]
[]
[]
[]
[]
[]
[]
[]
[]
[]
[]
[]
[]
[]
[]
[]
[]
[]
[]
[]
[]
[]
[]
[]
[]
[]
[]
[]
[]
[]
[]
[]
[]
[]
[]
[]
[]
[]
[]
[]
[]
[]
[]
[]
[]
[]
[]
[]
[]
[]
[]
[]
[]
[]
[]
[]
[]
[]
[]
[]
[]
[]
[]
[]
[]
[]
[]
[]
[]
[]
[]
[]
[]
[]
[]
[]
[]
[]
[]
[]
[]
[]
[]
[]
[]
[]
[]
[]
[]
[]
[]
[]
[]
[]
[]
[]
[]
[]
[]
[]
[]
[]
[]
[]
[]
[]
[]
[]
[]
[]
[]
[]
[]
[]
[]
[]
[]
[]
[]
[]
[]
[]
[]
[]
[]
[]
[]
[]
[]
[]
[]
[]
[]
[]
[]
[]
[]
[]
[]
[]
[]
[]
[]
[]
[]
[]
[]
[]
[]
[]
[]
[]
[]
[]
[]
[]
[]
[]
[]
[]
[]
[]
[]
[]
[]
[]
[]
[]
[]
[]
[]
[]
[]
[]
[]
[]
[]
[]
[]
[]
[]
[]
[]
[]
[]
[]
[]
[]
[]
[]
[]
[]
[]
[]
[]
[]
[]
[]
[]
[]
[]
[]
[]
[]
[]
[]
[]
[]
[]
[]
[]
[]
[]
[]
[]
[]
[]
[]
[]
[]
[]
[]
[]
[]
[]
[]
[]
[]
[]
[]
[]
[]
[]
[]
[]
[]
[]
[]
[]
[]
[]
[]
[]
[]
[]
[]
[]
[]
[]
[]
[]
[]
[]
[]
[]
[]
[]
[]
[]
[]
[]
[]
[]
[]
[]
[]
[]
[]
[]
[]
[]
[]
[]
[]
[]
[]
[]
[]
[]
[]
[]
[]
[]
[]
[]
[]
[]
[]
[]
[]
[]
[]
[]
[]
[]
[]
[]
[]
[]
[]
[]
[]
[]
[]
[]
[]
[]
[]
[]
[]
[]
[]
[]
[]
[]
[]
[]
[]
[]
[]
[]
[]
[]
[]
[]
[]
[]
[]
[]
[]
[]
[]
[]
[]
[]
[]
[]
[]
[]
[]
[]
[]
[]
[]
[]
[]
[]
[]
[]
[]
[]
[]
[]
[]
[]
[]
[]
[]
[]
[]
[]
[]
[]
[]
[]
[]
[]
[]
[]
[]
[]
[]
[]
[]
[]
[]
[]
[]
[]
[]
[]
[]
[]
[]
[]
[]
[]
[]
[]
[]
[]
[]
[]
[]
[]
[]
[]
[]
[]
[]
[]
[]
[]
[]
[]
[]
[]
[]
[]
[]
[]
[]
[]
[]
[]
[]
[]
[]
[]
[]
[]
[]
[]
[]
[]
[]
[]
[]
[]
[]
[]
[]
[]
[]
[]
[]
[]
[]
[]
[]
[]
[]
[]
[]
[]
[]
[]
[]
[]
[]
[]
[]
[]
[]
[]
[]
[]
[]
[]
[]
[]
[]
[]
[]
[]
[]
[]
[]
[]
[]
[]
[]
[]
[]
[]
[]
[]
[]
[]
[]
[]
[]
[]
[]
[]
[]
[]
[]
[]
[]
[]
[]
[]
[]
[]
[]
[]
[]
[]
[]
[]
[]
[]
[]
[]
[]
[]
[]
[]
[]
[]
[]
[]
[]
[]
[]
[]
[]
[]
[]
[]
[]
[]
[]
[]
[]
[]
[]
[]
[]
[]
[]
[]
[]
[]
[]
[]
[]
[]
[]
[]
[]
[]
[]
[]
[]
[]
[]
[]
[]
[]
[]
[]
[]
[]
[]
[]
[]
[]
[]
[]
[]
[]
[]
[]
[]
[]
[]
[]
[]
[]
[]
[]
[]
[]
[]
[]
[]
[]
[]
[]
[]
[]
[]
[]
[]
[]
[]
[]
[]
[]
[]
[]
[]
[]
[]
[]
[]
[]
[]
[]
[]
[]
[]
[]
[]
[]
[]
[]
[]
[]
[]
[]
[]
[]
[]
[]
[]
[]
[]
[]
[]
[]
[]
[]
[]
[]
[]
[]
[]
[]
[]
[]
[]
[]
[]
[]
[]
[]
[]
[]
[]
[]
[]
[]
[]
[]
[]
[]
[]
[]
[]
[]
[]
[]
[]
[]
[]
[]
[]
[]
[]
[]
[]
[]
[]
[]
[]
[]
[]
[]
[]
[]
[]
[]
[]
[]
[]
[]
[]
[]
[]
[]
[]
[]
[]
[]
[]
[]
[]
[]
[]
[]
[]
[]
[]
[]
[]
[]
[]
[]
[]
[]
[]
[]
[]
[]
[]
[]
[]
[]
[]
[]
[]
[]
[]
[]
[]
[]
[]
[]
[]
[]
[]
[]
[]
[]
[]
[]
[]
[]
[]
[]
[]
[]
[]
[]
[]
[]
[]
[]
[]
[]
[]
[]
[]
[]
[]
[]
[]
[]
[]
[]
[]
[]
[]
[]
[]
[]
[]
[]
[]
[]
[]
[]
[]
[]
[]
[]
[]
[]
[]
[]
[]
[]
[]
[]
[]
[]
[]
[]
[]
[]
[]
[]
[]
[]
[]
[]
[]
[]
[]
[]
[]
[]
[]
[]
[]
[]
[]
[]
[]
[]
[]
[]
[]
[]
[]
[]
[]
[]
[]
[]
[]
[]
[]
[]
[]
[]
[]
[]
[]
[]
[]
[]
[]
[]
[]
[]
[]
[]
[]
[]
[]
[]
[]
[]
[]
[]
[]
[]
[]
[]
[]
[]
[]
[]
[]
[]
[]
[]
[]
[]
[]
[]
[]
[]
[]
[]
[]
[]
[]
[]
[]
[]
[]
[]
[]
[]
[]
[]
[]
[]
[]
[]
[]
[]
[]
[]
[]
[]
[]
[]
[]
[]
[]
[]
[]
[]
[]
[]
[]
[]
[]
[]
[]
[]
[]
[]
[]
[]
[]
[]
[]
[]
[]
[]
[]
[]
[]
[]
[]
[]
[]
[]
[]
[]
[]
[]
[]
[]
[]
[]
[]
[]
[]
[]
[]
[]
[]
[]
[]
[]
[]
[]
[]
[]
[]
[]
[]
[]
[]
[]
[]
[]
[]
[]
[]
[]
[]
[]
[]
[]
[]
[]
[]
[]
[]
[]
[]
[]
[]
[]
[]
[]
[]
[]
[]
[]
[]
[]
[]
[]
[]
[]
[]
[]
[]
[]
[]
[]
[]
[]
[]
[]
[]
[]
[]
[]
[]
[]
[]
[]
[]
[]
[]
[]
[]
[]
[]
[]
[]
[]
[]
[]
[]
[]
[]
[]
[]
[]
[]
[]
[]
[]
[]
[]
[]
[]
[]
[]
[]
[]
[]
[]
[]
[]
[]
[]
[]
[]
[]
[]
[]
[]
[]
[]
[]
[]
[]
[]
[]
[]
[]
[]
[]
[]
[]
[]
[]
[]
[]
[]
[]
[]
[]
[]
[]
[]
[]
[]
[]
[]
[]
[]
[]
[]
[]
[]
[]
[]
[]
[]
[]
[]
[]
[]
[]
[]
[]
[]
[]
[]
[]
[]
[]
[]
[]
[]
[]
[]
[]
[]
[]
[]
[]
[]
[]
[]
[]
[]
[]
[]
[]
[]
[]
[]
[]
[]
[]
[]
[]
[]
[]
[]
[]
[]
[]
[]
[]
[]
[]
[]
[]
[]
[]
[]
[]
[]
[]
[]
[]
[]
[]
[]
[]
[]
[]
[]
[]
[]
[]
[]
[]
[]
[]
[]
[]
[]
[]
[]
[]
[]
[]
[]
[]
[]
[]
[]
[]
[]
[]
[]
[]
[]
[]
[]
[]
[]
[]
[]
[]
[]
[]
[]
[]
[]
[]
[null,"."]

{"sheet":"Berechnung d. Beurteilungswerte","index":5,"n_rows":41,"n_cols":51,"rows_kept":41,"cut":false,"hidden":false,"merged":[[40,1,40,10]]}
[]
[null,"Eingabe der letzten 10 Analysenergebnisse"]
[null,"Messwerte"]
[null,"Sb","As","Pb","Cd","Cr","Co","Ni","Hg","Chlor","Parameter 10","Parameter 11","Parameter 12","Parameter 13","Parameter 14","Parameter 15","Parameter 16","Parameter 17","Parameter 18","Parameter 19","Parameter 20","Parameter 21","Parameter 22","Parameter 23","Parameter 24","Parameter 25","Parameter 26","Parameter 27","Parameter 28","Parameter 29","Parameter 30","Parameter 31","Parameter 32","Parameter 33","Parameter 34","Parameter 35","Parameter 36","Parameter 37","Parameter 38","Parameter 39","Parameter 40","Parameter 41","Parameter 42","Parameter 43","Parameter 44","Parameter 45","Parameter 46","Parameter 47","Parameter 48","Parameter 49","Parameter 50"]
["Einheit","mg/kg TM","mg/kg TM","mg/kg TM","mg/kg TM","mg/kg TM","mg/kg TM","mg/kg TM","mg/kg TM","mg/kg TM","mg/kg TM","mg/kg TM","mg/kg TM","mg/kg TM","mg/kg TM","mg/kg TM","mg/kg TM","mg/kg TM","mg/kg TM","mg/kg TM","mg/kg TM","mg/kg TM","mg/kg TM","mg/kg TM","mg/kg TM","mg/kg TM","mg/kg TM","mg/kg TM","mg/kg TM","mg/kg TM","mg/kg TM","mg/kg TM","mg/kg TM","mg/kg TM","mg/kg TM","mg/kg TM","mg/kg TM","mg/kg TM","mg/kg TM","mg/kg TM","mg/kg TM","mg/kg TM","mg/kg TM","mg/kg TM","mg/kg TM","mg/kg TM","mg/kg TM","mg/kg TM","mg/kg TM","mg/kg TM","mg/kg TM"]
[]
[]
[1]
[2]
[3]
[4]
[5]
[6]
[7]
[8]
[9]
[10]
[]
[]
[]
[]
[]
[null,"Ergebnis massenbezogen"]
["Parameter",{"$f":"B4","v":"Sb"},{"$f":"C4","v":"As"},"Pb","Cd","Cr","Co","Ni","Hg","Chlor","Parameter 10","Parameter 11","Parameter 12","Parameter 13","Parameter 14","Parameter 15","Parameter 16","Parameter 17","Parameter 18","Parameter 19","Parameter 20","Parameter 21","Parameter 22","Parameter 23","Parameter 24","Parameter 25","Parameter 26","Parameter 27","Parameter 28","Parameter 29","Parameter 30","Parameter 31","Parameter 32","Parameter 33","Parameter 34","Parameter 35","Parameter 36","Parameter 37","Parameter 38","Parameter 39","Parameter 40","Parameter 41","Parameter 42","Parameter 43","Parameter 44","Parameter 45","Parameter 46","Parameter 47","Parameter 48","Parameter 49","Parameter 50"]
[null,{"$f":"B5","v":"mg/kg TM"},{"$f":"C5","v":"mg/kg TM"},"mg/kg TM","mg/kg TM","mg/kg TM","mg/kg TM","mg/kg TM","mg/kg TM","mg/kg TM","mg/kg TM","mg/kg TM","mg/kg TM","mg/kg TM","mg/kg TM","mg/kg TM","mg/kg TM","mg/kg TM","mg/kg TM","mg/kg TM","mg/kg TM","mg/kg TM","mg/kg TM","mg/kg TM","mg/kg TM","mg/kg TM","mg/kg TM","mg/kg TM","mg/kg TM","mg/kg TM","mg/kg TM","mg/kg TM","mg/kg TM","mg/kg TM","mg/kg TM","mg/kg TM","mg/kg TM","mg/kg TM","mg/kg TM","mg/kg TM","mg/kg TM","mg/kg TM","mg/kg TM","mg/kg TM","mg/kg TM","mg/kg TM","mg/kg TM","mg/kg TM","mg/kg TM","mg/kg TM","mg/kg TM"]
["Anzahl"]
["Median"]
["80-er Perzentil"]
["Verhältnisfaktor"]
[]
["aktueller Hu:",null,"\u0083   bitte ergänzen"]
[{"$f":"\"(\"&Einheit_Heizwert&\")\"","v":"(MJ/kg TM)"}]
[]
[null,"Ergebnis heizwertbezogen [mg/MJ]"]
[null,{"$f":"IF(ISBLANK(B24),\"\",B24)","v":"Sb"},{"$f":"IF(ISBLANK(C24),\"\",C24)","v":"As"},"Pb","Cd","Cr","Co","Ni","Hg","Chlor","Parameter 10",{"$f":"IF(ISBLANK(L24),\"\",L24)","v":"Parameter 11"},"Parameter 12","Parameter 13","Parameter 14","Parameter 15","Parameter 16","Parameter 17","Parameter 18","Parameter 19","Parameter 20","Parameter 21","Parameter 22","Parameter 23","Parameter 24","Parameter 25","Parameter 26","Parameter 27","Parameter 28","Parameter 29","Parameter 30","Parameter 31","Parameter 32","Parameter 33","Parameter 34","Parameter 35","Parameter 36","Parameter 37","Parameter 38","Parameter 39","Parameter 40","Parameter 41","Parameter 42","Parameter 43","Parameter 44","Parameter 45","Parameter 46","Parameter 47","Parameter 48","Parameter 49","Parameter 50"]
[null,"mg/MJ","mg/MJ","mg/MJ","mg/MJ","mg/MJ","mg/MJ","mg/MJ","mg/MJ","mg/MJ","mg/MJ","mg/MJ","mg/MJ","mg/MJ","mg/MJ","mg/MJ","mg/MJ","mg/MJ","mg/MJ","mg/MJ","mg/MJ","mg/MJ","mg/MJ","mg/MJ","mg/MJ","mg/MJ","mg/MJ","mg/MJ","mg/MJ","mg/MJ","mg/MJ","mg/MJ","mg/MJ","mg/MJ","mg/MJ","mg/MJ","mg/MJ","mg/MJ","mg/MJ","mg/MJ","mg/MJ","mg/MJ","mg/MJ","mg/MJ","mg/MJ","mg/MJ","mg/MJ","mg/MJ","mg/MJ","mg/MJ","mg/MJ"]
["Median",{"$f":"+IFERROR(B27/Hu_aktuell,B27)","v":0},0,0,0,0,0,0,0,0,0,{"$f":"+IFERROR(L27/Hu_aktuell,L27)","v":0},0,0,0,0,0,0,0,0,0,0,0,0,0,0,0,0,0,0,0,0,0,0,0,0,0,0,0,0,0,0,0,0,0,0,0,0,0,0,0]
["80-er Perzentil",{"$f":"+IFERROR(B28/Hu_aktuell,B28)","v":0},0,0,0,0,0,0,0,0,0,{"$f":"+IFERROR(L28/Hu_aktuell,L28)","v":0},0,0,0,0,0,0,0,0,0,0,0,0,0,0,0,0,0,0,0,0,0,0,0,0,0,0,0,0,0,0,0,0,0,0,0,0,0,0,0]
["Verhältnisfaktor",{"$f":"+IF(ISNUMBER(B29),B29,\"\")","v":""},{"$f":"+IF(ISNUMBER(C29),C29,\"\")","v":""},"","","","","","","","",{"$f":"+IF(ISNUMBER(L29),L29,\"\")","v":""},"","","","","","","","","","","","","","","","","","","","","","","","","","","","","","","","","","","","","","",""]
[]
[null,"berechnet am 27.05.2024 um 16:13:43"]

{"sheet":"Einhaltung der Grenzwerte","index":6,"n_rows":35,"n_cols":53,"rows_kept":35,"cut":false,"hidden":false,"merged":[[29,2,31,2],[32,2,34,2],[0,2,3,2],[11,2,13,2],[14,2,16,2],[17,2,19,2],[20,2,22,2],[23,2,25,2],[26,2,28,2]]}
["Farbcode","Parameter","Kennung des Beurteilungs-nachweises","Sb","As","Pb","Cd","Cr","Co","Ni","Hg",{"$f":"'Berechnung d. Beurteilungswerte'!J35","v":"Chlor"},{"$f":"'Berechnung d. Beurteilungswerte'!K35","v":"Parameter 10"},{"$f":"'Berechnung d. Beurteilungswerte'!L35","v":"Parameter 11"},{"$f":"'Berechnung d. Beurteilungswerte'!M35","v":"Parameter 12"},{"$f":"'Berechnung d. Beurteilungswerte'!N35","v":"Parameter 13"},{"$f":"'Berechnung d. Beurteilungswerte'!O35","v":"Parameter 14"},{"$f":"'Berechnung d. Beurteilungswerte'!P35","v":"Parameter 15"},{"$f":"'Berechnung d. Beurteilungswerte'!Q35","v":"Parameter 16"},{"$f":"'Berechnung d. Beurteilungswerte'!R35","v":"Parameter 17"},{"$f":"'Berechnung d. Beurteilungswerte'!S35","v":"Parameter 18"},{"$f":"'Berechnung d. Beurteilungswerte'!T35","v":"Parameter 19"},{"$f":"'Berechnung d. Beurteilungswerte'!U35","v":"Parameter 20"},{"$f":"'Berechnung d. Beurteilungswerte'!V35","v":"Parameter 21"},{"$f":"'Berechnung d. Beurteilungswerte'!W35","v":"Parameter 22"},{"$f":"'Berechnung d. Beurteilungswerte'!X35","v":"Parameter 23"},{"$f":"'Berechnung d. Beurteilungswerte'!Y35","v":"Parameter 24"},{"$f":"'Berechnung d. Beurteilungswerte'!Z35","v":"Parameter 25"},{"$f":"'Berechnung d. Beurteilungswerte'!AA35","v":"Parameter 26"},{"$f":"'Berechnung d. Beurteilungswerte'!AB35","v":"Parameter 27"},{"$f":"'Berechnung d. Beurteilungswerte'!AC35","v":"Parameter 28"},{"$f":"'Berechnung d. Beurteilungswerte'!AD35","v":"Parameter 29"},{"$f":"'Berechnung d. Beurteilungswerte'!AE35","v":"Parameter 30"},{"$f":"'Berechnung d. Beurteilungswerte'!AF35","v":"Parameter 31"},{"$f":"'Berechnung d. Beurteilungswerte'!AG35","v":"Parameter 32"},{"$f":"'Berechnung d. Beurteilungswerte'!AH35","v":"Parameter 33"},{"$f":"'Berechnung d. Beurteilungswerte'!AI35","v":"Parameter 34"},{"$f":"'Berechnung d. Beurteilungswerte'!AJ35","v":"Parameter 35"},{"$f":"'Berechnung d. Beurteilungswerte'!AK35","v":"Parameter 36"},{"$f":"'Berechnung d. Beurteilungswerte'!AL35","v":"Parameter 37"},{"$f":"'Berechnung d. Beurteilungswerte'!AM35","v":"Parameter 38"},{"$f":"'Berechnung d. Beurteilungswerte'!AN35","v":"Parameter 39"},{"$f":"'Berechnung d. Beurteilungswerte'!AO35","v":"Parameter 40"},{"$f":"'Berechnung d. Beurteilungswerte'!AP35","v":"Parameter 41"},{"$f":"'Berechnung d. Beurteilungswerte'!AQ35","v":"Parameter 42"},{"$f":"'Berechnung d. Beurteilungswerte'!AR35","v":"Parameter 43"},{"$f":"'Berechnung d. Beurteilungswerte'!AS35","v":"Parameter 44"},{"$f":"'Berechnung d. Beurteilungswerte'!AT35","v":"Parameter 45"},{"$f":"'Berechnung d. Beurteilungswerte'!AU35","v":"Parameter 46"},{"$f":"'Berechnung d. Beurteilungswerte'!AV35","v":"Parameter 47"},{"$f":"'Berechnung d. Beurteilungswerte'!AW35","v":"Parameter 48"},{"$f":"'Berechnung d. Beurteilungswerte'!AX35","v":"Parameter 49"},{"$f":"'Berechnung d. Beurteilungswerte'!AY35","v":"Parameter 50"}]
["<=20% GW","Einheit",null,"mg/MJ","mg/MJ","mg/MJ","mg/MJ","mg/MJ","mg/MJ","mg/MJ","mg/MJ",{"$f":"'Berechnung d. Beurteilungswerte'!J36","v":"mg/MJ"},{"$f":"'Berechnung d. Beurteilungswerte'!K36","v":"mg/MJ"},{"$f":"'Berechnung d. Beurteilungswerte'!L36","v":"mg/MJ"},{"$f":"'Berechnung d. Beurteilungswerte'!M36","v":"mg/MJ"},{"$f":"'Berechnung d. Beurteilungswerte'!N36","v":"mg/MJ"},{"$f":"'Berechnung d. Beurteilungswerte'!O36","v":"mg/MJ"},{"$f":"'Berechnung d. Beurteilungswerte'!P36","v":"mg/MJ"},{"$f":"'Berechnung d. Beurteilungswerte'!Q36","v":"mg/MJ"},{"$f":"'Berechnung d. Beurteilungswerte'!R36","v":"mg/MJ"},{"$f":"'Berechnung d. Beurteilungswerte'!S36","v":"mg/MJ"},{"$f":"'Berechnung d. Beurteilungswerte'!T36","v":"mg/MJ"},{"$f":"'Berechnung d. Beurteilungswerte'!U36","v":"mg/MJ"},{"$f":"'Berechnung d. Beurteilungswerte'!V36","v":"mg/MJ"},{"$f":"'Berechnung d. Beurteilungswerte'!W36","v":"mg/MJ"},{"$f":"'Berechnung d. Beurteilungswerte'!X36","v":"mg/MJ"},{"$f":"'Berechnung d. Beurteilungswerte'!Y36","v":"mg/MJ"},{"$f":"'Berechnung d. Beurteilungswerte'!Z36","v":"mg/MJ"},{"$f":"'Berechnung d. Beurteilungswerte'!AA36","v":"mg/MJ"},{"$f":"'Berechnung d. Beurteilungswerte'!AB36","v":"mg/MJ"},{"$f":"'Berechnung d. Beurteilungswerte'!AC36","v":"mg/MJ"},{"$f":"'Berechnung d. Beurteilungswerte'!AD36","v":"mg/MJ"},{"$f":"'Berechnung d. Beurteilungswerte'!AE36","v":"mg/MJ"},{"$f":"'Berechnung d. Beurteilungswerte'!AF36","v":"mg/MJ"},{"$f":"'Berechnung d. Beurteilungswerte'!AG36","v":"mg/MJ"},{"$f":"'Berechnung d. Beurteilungswerte'!AH36","v":"mg/MJ"},{"$f":"'Berechnung d. Beurteilungswerte'!AI36","v":"mg/MJ"},{"$f":"'Berechnung d. Beurteilungswerte'!AJ36","v":"mg/MJ"},{"$f":"'Berechnung d. Beurteilungswerte'!AK36","v":"mg/MJ"},{"$f":"'Berechnung d. Beurteilungswerte'!AL36","v":"mg/MJ"},{"$f":"'Berechnung d. Beurteilungswerte'!AM36","v":"mg/MJ"},{"$f":"'Berechnung d. Beurteilungswerte'!AN36","v":"mg/MJ"},{"$f":"'Berechnung d. Beurteilungswerte'!AO36","v":"mg/MJ"},{"$f":"'Berechnung d. Beurteilungswerte'!AP36","v":"mg/MJ"},{"$f":"'Berechnung d. Beurteilungswerte'!AQ36","v":"mg/MJ"},{"$f":"'Berechnung d. Beurteilungswerte'!AR36","v":"mg/MJ"},{"$f":"'Berechnung d. Beurteilungswerte'!AS36","v":"mg/MJ"},{"$f":"'Berechnung d. Beurteilungswerte'!AT36","v":"mg/MJ"},{"$f":"'Berechnung d. Beurteilungswerte'!AU36","v":"mg/MJ"},{"$f":"'Berechnung d. Beurteilungswerte'!AV36","v":"mg/MJ"},{"$f":"'Berechnung d. Beurteilungswerte'!AW36","v":"mg/MJ"},{"$f":"'Berechnung d. Beurteilungswerte'!AX36","v":"mg/MJ"},{"$f":"'Berechnung d. Beurteilungswerte'!AY36","v":"mg/MJ"}]
[">20% GW; <=50% GW","Grenzwert Median",null,7,2,20,0.23,25,1.5,10,7.4999999999999997E-2,"-","-","-","-","-","-","-","-","-","-","-","-","-","-","-","-","-","-","-","-","-","-","-","-","-","-","-","-","-","-","-","-","-","-","-","-","-","-","-","-","-","-"]
[">50% GW, <80%GW","Grenzwert 80-er Perzentil",null,10,3,36,0.46,37,2.7,18,0.15,"-","-","-","-","-","-","-","-","-","-","-","-","-","-","-","-","-","-","-","-","-","-","-","-","-","-","-","-","-","-","-","-","-","-","-","-","-","-","-","-","-","-"]
[">=80% GW, =GW","Analysenergebnis 1"]
[">GW","Analysenergebnis 2"]
[null,"Analysenergebnis 3"]
["Bei Verhältnisfaktor","Analysenergebnis 4"]
["<= 1.5","Mittelwert 1"]
["> 1.5","Mittelwert 2"]
[null,"Mittelwert 3"]
[null,"Median"]
[null,"80-er Perzentil"]
[null,"Verhältnisfaktor"]
[null,"Median"]
[null,"80-er Perzentil"]
[null,"Verhältnisfaktor"]
[null,"Median"]
[null,"80-er Perzentil"]
[null,"Verhältnisfaktor"]
[null,"Median"]
[null,"80-er Perzentil"]
[null,"Verhältnisfaktor"]
[null,"Median"]
[null,"80-er Perzentil"]
[null,"Verhältnisfaktor"]
[null,"Median"]
[null,"80-er Perzentil"]
[null,"Verhältnisfaktor"]
[null,"Median"]
[null,"80-er Perzentil"]
[null,"Verhältnisfaktor"]
[null,"Median"]
[null,"80-er Perzentil"]
[null,"Verhältnisfaktor"]

{"sheet":"Info zur Benutzung des Makros","index":7,"n_rows":163,"n_cols":5,"rows_kept":163,"cut":false,"hidden":false,"merged":[[161,1,161,9],[162,1,162,9],[160,1,160,9],[79,1,79,9],[82,1,82,9],[83,1,83,9],[84,1,84,9],[86,1,86,9],[80,1,80,9],[96,2,96,3],[96,4,96,9],[95,4,95,9],[95,2,95,3],[159,1,159,9],[98,1,98,9],[99,1,99,9],[34,1,34,9],[46,1,46,9],[47,1,47,9],[49,1,49,9],[57,1,57,9],[27,1,27,9],[29,1,29,9],[30,1,30,9],[32,1,32,9],[33,1,33,9],[21,1,21,9],[23,1,23,9],[24,1,24,9],[25,1,25,9],[26,1,26,9],[15,1,15,9],[17,1,17,9],[18,1,18,9],[19,1,19,9],[20,1,20,9],[100,1,100,9],[101,1,101,9],[121,1,121,9],[124,1,124,9],[125,1,125,9],[87,1,87,9],[88,2,88,9],[89,2,89,9],[90,2,90,9],[93,1,93,9],[1,1,1,9],[36,1,36,9],[31,1,31,9],[39,1,39,9],[42,1,42,9],[3,1,3,9],[5,1,5,9],[7,1,7,9],[8,1,8,9],[2,1,2,9],[9,1,9,9],[37,1,37,9],[40,1,40,9],[11,1,11,9],[12,1,12,9],[13,1,13,9],[76,1,76,9],[43,1,43,9],[44,1,44,9],[75,1,75,9],[72,1,72,9],[52,1,52,9],[54,1,54,9],[63,1,63,9],[53,1,53,9],[71,1,71,9],[58,1,58,9],[61,1,61,9],[62,1,62,9],[66,1,66,9],[67,1,67,9],[68,1,68,9]]}
[null,"Information zur Benutzung des Makros"]
[null,"Allgemeines"]
[null,"Das Makro zur Berechnung der Beurteilungswerte (Quantile) wird für die Anwendenden"]
[null,"kostenlos zur Verfügung gestellt."]
[]
[null,"Der/die Anwender:in ist für die korrekte Eingabe der Daten verantwortlich."]
[]
[null,"Da die Anwendenden über unterschiedliche Betriebssysteme und Excelversionen verfügen,"]
[null,"ist jedenfalls vor der routinemäßigen Verwendung das Makro mit einem Testdatensatz"]
[null,"auf Funktionalität zu testen."]
[]
[null,"Vorgeschlagen wird ein Testdatensatz, der die Fälle „n.n.“ (Berechnung mit „0“), "]
[null,"< 0,5 (Berechnung mit dem Wert der halben Bestimmungsgrenze, hier 0,25; "]
[null,"Dezimaltrennzeichen entsprechend Excel Ländereinstellungen) und „Text“ enthält. "]
[]
[null,"Die Randbedingungen zur korrekten Bedienung des Makros finden sich nachstehend."]
[null,"Funktionalität (Makro)"]
[null,"Je nach Excel-Version und Sicherheitseinstellungen muss die Ausführung von Makros"]
[null,"zugelassen werden. "]
[null,"Möglicherweise brauchen Sie dafür zudem Administratorrechte auf Ihrem Rechner."]
[null,"Im einfachsten Fall erscheint beim Öffnen der Mappe ein Sicherheitshinweis, mit der Option,"]
[null,"die Ausführung von Makros in dieser Arbeitsmappe zuzulassen."]
[]
[null,"Es kann außerdem sein, dass die Ausführung von Makros ohne gesonderte Nachfrage "]
[null,"unterbunden wird. In diesem Fall kann es helfen, den Speicherort der Arbeitsmappe als "]
[null,"vertrauenswürdigen Speicherort festzulegen:"]
[null,"Datei > Optionen > Trust Center >  Einstellungen für das TrustCenter > Vertrauenswürdige"]
[null,"Speicherorte"]
[]
[null,"Bei älteren Excel-Versionen erfolgt diese Einstellung über die Menüleiste:"]
[null,"- Extras"]
[null,"- Optionen"]
[null,"- Reiter Sicherheit"]
[null,"- Schaltfläche Makrosicherheit"]
[null,"Zur Ausführung des Makros muss die Makrosicherheit auf 'niedrig' eingestellt sein."]
[]
[null,"Bei aktuelleren Excel-Versionen erscheint automatisch beim Öffnen der Datei die Abfrage "]
[null,"zur Aktivierung des Makroinhaltes."]
[null,"Arbeitsblätter"]
[null,"Die Arbeitsblätter 'Analysenergebnisse' und 'Berechnung d. Beurteilungswerte' dürfen"]
[null,"weder umbenannt noch gelöscht werden."]
[]
[null,"Im Falle eines vollständig befüllten Arbeitsblattes 'Analysenergebnisse' empfiehlt sich die "]
[null,"Speicherung der Datei unter eindeutigem Namen und das Arbeitsblatt "]
[null,"Analysenergebnisse' des Rohmakros wird neu befüllt."]
[]
[null,"Achten Sie bitte darauf, dass für jeden Parameter die letzten 10 Werte übernommen"]
[null,"werden. "]
[]
[null,"Das Arbeitsblatt 'Tabelle 1' steht Ihnen für weitere Berechnungen zur Verfügung."]
[]
[null,"Dateneingabe"]
[null,"Die Eingabe der 10 aktuellsten Daten erfolgt entweder durch manuelle Eingabe im"]
[null,"Arbeitsblatt 'Berechnung d. Beurteilungswerte' oder durch automatische Übernahme"]
[null,"aus dem Arbeitsblatt 'Analysenergebnisse'."]
[]
[null,"Button"]
[null,"Das Klicken dieser Schaltfläche ermöglicht die manuelle Eingabe der Daten bzw. können"]
[null,"Daten eingefügt werden."]
[]
[null,"Button"]
[null,"Die zehn aktuellsten Werte (d.h. die in der Liste zehn letztgereihten) der im Arbeitsblatt"]
[null,"'Analysenergebnisse' eingegebenen Daten werden durch das Klicken dieser Schaltfläche"]
[null,"automatisch ins Arbeitsblatt 'Berechnung d. Beurteilungswerte' übertragen. "]
[]
[null,"Gesperrte Zellen"]
[null,"Das Makro greift auf alle mit Hintergrundfarbe formatierten Zellen (in blau) zu."]
[null,"Die Zellen im Registerblatt 'Berechnung d. Beurteilungswerte' sind je nach Anforderung"]
[null,"gesperrt bzw. geschützt."]
[]
[null,"Button"]
[null,"Mit diesem Button können die automatisch übernommenen oder manuell eingegebenen"]
[null,"Daten im Arbeitsblatt 'Berechnung d. Beurteilungswerte' gelöscht werden. "]
[]
[null,"Button"]
[null,"Klicken Sie auf die Schaltfläche zur Berechnung der Quantile und des Verhältnisfaktors"]
[null,"(informativ) im Arbeitsblatt 'Berechnung d. Beurteilungswerte'."]
[]
[null,"Weitere Hinweise zur Dateineingabe"]
[null,"Um Daten einer anderen Tabelle/Quelle einzufügen, wird das Einfügen von Werten"]
[null,"(Menü: Bearbeiten / Inhalte einfügen … / Werte) empfohlen."]
[]
[null,"Die vorgeschlagenen Parameter samt Einheiten für Sb bis Hg sind nicht editierbar."]
[null,"Cl und die durchnummerierten Parameter (hier 10 - 50) sind editierbar (Parameter, Einheit)."]
[null,"Die Einheiten der Parameter sind auf Korrektheit zu prüfen."]
[]
[null,"Aufgrund der verschiedenen Dezimaltrennzeichen (entsprechend Excel Ländereinstellung)"]
[null,"ist darauf zu achten, dass Werte nicht im Datumsformat eingegeben werden."]
[null,"Beispiel:","Bei Excel Ländereinstellung Dezimaltrennzeichen 'Komma' und bei Eingabe"]
[null,null,"von 3.4 anstatt 3,4 wird die Eingabe automatisch in 03. April 2024 umgewandelt,"]
[null,null,"und in weiterer Folge als Zahlenwert (= 45385) berücksichtigt."]
[]
[null,"Mögliche Werte"]
[null,"Zahlen und folgende 'Strings' (Zeichenketten) sind zulässige Dateneingaben:"]
[null,"Eingabe","Bedeutung",null,"Berücksichtigung"]
[null,"n.n.","nicht nachweisbar",null,"Es wird automatisch 0 (sprich NULL) zur weiteren \nBerechnung verwendet."]
[null,"<BG","kleiner \nBestimmungs- \ngrenze",null,"Mit halber Bestimmungsgrenze wird gerechnet.\nz.B. <0,7 bedeutet 0,35. \n\nVORSICHT:\nWenn Punkt als Dezimaltrennzeichen definiert ist, muss die Bestimmungsgrenze im selben Format eingegeben werden. \nz.B. <0.7"]
[]
[null,"Nicht zulässige Dateneingaben werden bei der Berechnung der Quantile ausgeschlossen."]
[null,"Durch pinke Füllfarbe werden diese gekennzeichnet."]
[null,"(Musterbeispiel: hier z.B. Einstellung Dezimaltrennzeichen mit Punkt, daher"]
[null," <17.0 korrekt, zugleich < 17,0 nicht in Ordnung und pink markiert)"]
[]
[]
[]
[]
[]
[]
[]
[]
[]
[]
[]
[]
[]
[]
[]
[]
[]
[]
[null,"Weitere Hinweise"]
[null,"Es wird empfohlen, bei der Durchführung der Makros andere Excel-Dateien zu schließen."]
[]
[null,"Ausdruck"]
[null,"Die Spalten A und B wurden als Wiederholungsspalten und die Zeilen 1 und 2 als"]
[null,"Wiederholungszeilen definiert, um einen geeigneten Ausdruck der Ergebnisse zu erzielen."]
[]
[]
[]
[]
[]
[]
[]
[]
[]
[]
[]
[]
[]
[]
[]
[]
[]
[]
[]
[]
[]
[]
[]
[]
[]
[]
[]
[]
[]
[]
[]
[]
[null,"Gewährleistungs- und Haftungsausschluss"]
[null,"Es besteht keinerlei Gewährleistung für das kostenlos zur Verfügung gestellte Programm"]
[null,"und das BMK ist den Anwender:innen gegenüber für irgendwelche Schäden, die aus der "]
[null,"Benutzung des Programms folgen, in keinem Fall haftbar. "]
[null,"Ende "]

{"sheet":"Recycling-Index","index":8,"n_rows":23,"n_cols":15,"rows_kept":23,"cut":false,"hidden":false,"merged":[[1,0,3,0],[1,1,3,1]]}
[null,null,null,null,null,"Aschezusammensetzung"]
["Probenbezeichnung","Beurteilungsnachweis\n(Kennung)                     ","R-Index4","R-Index9","Aschegehalt 815°C (Adb)","Al2O3","CaO","Fe2O3","SiO2","K2O","MgO","Na2O","SO3","TiO2","Probenbeschreibung"]
[null,null,"% TM","% TM","% TM","mg/kg TM","mg/kg TM","mg/kg TM","mg/kg TM","mg/kg TM","mg/kg TM","mg/kg TM","mg/kg TM","mg/kg TM"]
[]
[null,null,{"$f":"(E5/100)*(F5+G5+H5+I5)/10000","v":0},{"$f":"(E5/100)*(F5+G5+H5+I5+J5+K5+L5+M5+N5)/10000","v":0}]
[null,null,{"$f":"(E6/100)*(F6+G6+H6+I6)/10000","v":0},{"$f":"(E6/100)*(F6+G6+H6+I6+J6+K6+L6+M6+N6)/10000","v":0}]
[null,null,0,0]
[null,null,0,0]
[null,null,0,0]
[null,null,0,0]
[null,null,0,0]
[null,null,0,0]
[null,null,0,0]
[null,null,0,0]
[null,null,0,0]
[null,null,0,0]
[null,null,0,0]
[null,null,0,0]
[null,null,0,0]
[null,null,0,0]
[null,null,0,0]
[null,null,0,0]
[null,null,0,0]

{"sheet":"Tabelle1","index":9,"n_rows":0,"n_cols":0,"rows_kept":0,"cut":false,"hidden":false,"merged":[]}

{"sheet":"RECHNEN","index":10,"n_rows":33,"n_cols":208,"rows_kept":33,"cut":false,"hidden":true,"merged":[]}
[null,null,null,null,null,null,null,null,null,null,null,null,null,null,null,null,null,null,null,null,null,null,null,null,null,null,null,null,null,null,null,null,null,null,null,null,null,null,null,null,null,null,null,null,null,null,null,null,null,null,null,null,"Ersetzen",{"$f":"IF(B1=\"n.n.\",0,(IF(AND(LEFT(B1,1)=\"<\",ISNUMBER(MID(B1,2,500)*1)),RIGHT(B1,LEN(B1)-1)/2,(IF(ISNUMBER(B1),B1,\"\")))))","v":""},{"$f":"IF(C1=\"n.n.\",0,(IF(AND(LEFT(C1,1)=\"<\",ISNUMBER(MID(C1,2,500)*1)),RIGHT(C1,LEN(C1)-1)/2,(IF(ISNUMBER(C1),C1,\"\")))))","v":""},"",{"$f":"IF(E1=\"n.n.\",0,(IF(AND(LEFT(E1,1)=\"<\",ISNUMBER(MID(E1,2,500)*1)),RIGHT(E1,LEN(E1)-1)/2,(IF(ISNUMBER(E1),E1,\"\")))))","v":""},{"$f":"IF(F1=\"n.n.\",0,(IF(AND(LEFT(F1,1)=\"<\",ISNUMBER(MID(F1,2,500)*1)),RIGHT(F1,LEN(F1)-1)/2,(IF(ISNUMBER(F1),F1,\"\")))))","v":""},{"$f":"IF(G1=\"n.n.\",0,(IF(AND(LEFT(G1,1)=\"<\",ISNUMBER(MID(G1,2,500)*1)),RIGHT(G1,LEN(G1)-1)/2,(IF(ISNUMBER(G1),G1,\"\")))))","v":""},{"$f":"IF(H1=\"n.n.\",0,(IF(AND(LEFT(H1,1)=\"<\",ISNUMBER(MID(H1,2,500)*1)),RIGHT(H1,LEN(H1)-1)/2,(IF(ISNUMBER(H1),H1,\"\")))))","v":""},{"$f":"IF(I1=\"n.n.\",0,(IF(AND(LEFT(I1,1)=\"<\",ISNUMBER(MID(I1,2,500)*1)),RIGHT(I1,LEN(I1)-1)/2,(IF(ISNUMBER(I1),I1,\"\")))))","v":""},{"$f":"IF(J1=\"n.n.\",0,(IF(AND(LEFT(J1,1)=\"<\",ISNUMBER(MID(J1,2,500)*1)),RIGHT(J1,LEN(J1)-1)/2,(IF(ISNUMBER(J1),J1,\"\")))))","v":""},{"$f":"IF(K1=\"n.n.\",0,(IF(AND(LEFT(K1,1)=\"<\",ISNUMBER(MID(K1,2,500)*1)),RIGHT(K1,LEN(K1)-1)/2,(IF(ISNUMBER(K1),K1,\"\")))))","v":""},{"$f":"IF(L1=\"n.n.\",0,(IF(AND(LEFT(L1,1)=\"<\",ISNUMBER(MID(L1,2,500)*1)),RIGHT(L1,LEN(L1)-1)/2,(IF(ISNUMBER(L1),L1,\"\")))))","v":""},{"$f":"IF(M1=\"n.n.\",0,(IF(AND(LEFT(M1,1)=\"<\",ISNUMBER(MID(M1,2,500)*1)),RIGHT(M1,LEN(M1)-1)/2,(IF(ISNUMBER(M1),M1,\"\")))))","v":""},{"$f":"IF(N1=\"n.n.\",0,(IF(AND(LEFT(N1,1)=\"<\",ISNUMBER(MID(N1,2,500)*1)),RIGHT(N1,LEN(N1)-1)/2,(IF(ISNUMBER(N1),N1,\"\")))))","v":""},{"$f":"IF(O1=\"n.n.\",0,(IF(AND(LEFT(O1,1)=\"<\",ISNUMBER(MID(O1,2,500)*1)),RIGHT(O1,LEN(O1)-1)/2,(IF(ISNUMBER(O1),O1,\"\")))))","v":""},{"$f":"IF(P1=\"n.n.\",0,(IF(AND(LEFT(P1,1)=\"<\",ISNUMBER(MID(P1,2,500)*1)),RIGHT(P1,LEN(P1)-1)/2,(IF(ISNUMBER(P1),P1,\"\")))))","v":""},{"$f":"IF(Q1=\"n.n.\",0,(IF(AND(LEFT(Q1,1)=\"<\",ISNUMBER(MID(Q1,2,500)*1)),RIGHT(Q1,LEN(Q1)-1)/2,(IF(ISNUMBER(Q1),Q1,\"\")))))","v":""},{"$f":"IF(R1=\"n.n.\",0,(IF(AND(LEFT(R1,1)=\"<\",ISNUMBER(MID(R1,2,500)*1)),RIGHT(R1,LEN(R1)-1)/2,(IF(ISNUMBER(R1),R1,\"\")))))","v":""},{"$f":"IF(S1=\"n.n.\",0,(IF(AND(LEFT(S1,1)=\"<\",ISNUMBER(MID(S1,2,500)*1)),RIGHT(S1,LEN(S1)-1)/2,(IF(ISNUMBER(S1),S1,\"\")))))","v":""},{"$f":"IF(T1=\"n.n.\",0,(IF(AND(LEFT(T1,1)=\"<\",ISNUMBER(MID(T1,2,500)*1)),RIGHT(T1,LEN(T1)-1)/2,(IF(ISNUMBER(T1),T1,\"\")))))","v":""},{"$f":"IF(U1=\"n.n.\",0,(IF(AND(LEFT(U1,1)=\"<\",ISNUMBER(MID(U1,2,500)*1)),RIGHT(U1,LEN(U1)-1)/2,(IF(ISNUMBER(U1),U1,\"\")))))","v":""},{"$f":"IF(V1=\"n.n.\",0,(IF(AND(LEFT(V1,1)=\"<\",ISNUMBER(MID(V1,2,500)*1)),RIGHT(V1,LEN(V1)-1)/2,(IF(ISNUMBER(V1),V1,\"\")))))","v":""},{"$f":"IF(W1=\"n.n.\",0,(IF(AND(LEFT(W1,1)=\"<\",ISNUMBER(MID(W1,2,500)*1)),RIGHT(W1,LEN(W1)-1)/2,(IF(ISNUMBER(W1),W1,\"\")))))","v":""},{"$f":"IF(X1=\"n.n.\",0,(IF(AND(LEFT(X1,1)=\"<\",ISNUMBER(MID(X1,2,500)*1)),RIGHT(X1,LEN(X1)-1)/2,(IF(ISNUMBER(X1),X1,\"\")))))","v":""},{"$f":"IF(Y1=\"n.n.\",0,(IF(AND(LEFT(Y1,1)=\"<\",ISNUMBER(MID(Y1,2,500)*1)),RIGHT(Y1,LEN(Y1)-1)/2,(IF(ISNUMBER(Y1),Y1,\"\")))))","v":""},{"$f":"IF(Z1=\"n.n.\",0,(IF(AND(LEFT(Z1,1)=\"<\",ISNUMBER(MID(Z1,2,500)*1)),RIGHT(Z1,LEN(Z1)-1)/2,(IF(ISNUMBER(Z1),Z1,\"\")))))","v":""},{"$f":"IF(AA1=\"n.n.\",0,(IF(AND(LEFT(AA1,1)=\"<\",ISNUMBER(MID(AA1,2,500)*1)),RIGHT(AA1,LEN(AA1)-1)/2,(IF(ISNUMBER(AA1),AA1,\"\")))))","v":""},{"$f":"IF(AB1=\"n.n.\",0,(IF(AND(LEFT(AB1,1)=\"<\",ISNUMBER(MID(AB1,2,500)*1)),RIGHT(AB1,LEN(AB1)-1)/2,(IF(ISNUMBER(AB1),AB1,\"\")))))","v":""},{"$f":"IF(AC1=\"n.n.\",0,(IF(AND(LEFT(AC1,1)=\"<\",ISNUMBER(MID(AC1,2,500)*1)),RIGHT(AC1,LEN(AC1)-1)/2,(IF(ISNUMBER(AC1),AC1,\"\")))))","v":""},{"$f":"IF(AD1=\"n.n.\",0,(IF(AND(LEFT(AD1,1)=\"<\",ISNUMBER(MID(AD1,2,500)*1)),RIGHT(AD1,LEN(AD1)-1)/2,(IF(ISNUMBER(AD1),AD1,\"\")))))","v":""},{"$f":"IF(AE1=\"n.n.\",0,(IF(AND(LEFT(AE1,1)=\"<\",ISNUMBER(MID(AE1,2,500)*1)),RIGHT(AE1,LEN(AE1)-1)/2,(IF(ISNUMBER(AE1),AE1,\"\")))))","v":""},{"$f":"IF(AF1=\"n.n.\",0,(IF(AND(LEFT(AF1,1)=\"<\",ISNUMBER(MID(AF1,2,500)*1)),RIGHT(AF1,LEN(AF1)-1)/2,(IF(ISNUMBER(AF1),AF1,\"\")))))","v":""},{"$f":"IF(AG1=\"n.n.\",0,(IF(AND(LEFT(AG1,1)=\"<\",ISNUMBER(MID(AG1,2,500)*1)),RIGHT(AG1,LEN(AG1)-1)/2,(IF(ISNUMBER(AG1),AG1,\"\")))))","v":""},{"$f":"IF(AH1=\"n.n.\",0,(IF(AND(LEFT(AH1,1)=\"<\",ISNUMBER(MID(AH1,2,500)*1)),RIGHT(AH1,LEN(AH1)-1)/2,(IF(ISNUMBER(AH1),AH1,\"\")))))","v":""},{"$f":"IF(AI1=\"n.n.\",0,(IF(AND(LEFT(AI1,1)=\"<\",ISNUMBER(MID(AI1,2,500)*1)),RIGHT(AI1,LEN(AI1)-1)/2,(IF(ISNUMBER(AI1),AI1,\"\")))))","v":""},{"$f":"IF(AJ1=\"n.n.\",0,(IF(AND(LEFT(AJ1,1)=\"<\",ISNUMBER(MID(AJ1,2,500)*1)),RIGHT(AJ1,LEN(AJ1)-1)/2,(IF(ISNUMBER(AJ1),AJ1,\"\")))))","v":""},{"$f":"IF(AK1=\"n.n.\",0,(IF(AND(LEFT(AK1,1)=\"<\",ISNUMBER(MID(AK1,2,500)*1)),RIGHT(AK1,LEN(AK1)-1)/2,(IF(ISNUMBER(AK1),AK1,\"\")))))","v":""},{"$f":"IF(AL1=\"n.n.\",0,(IF(AND(LEFT(AL1,1)=\"<\",ISNUMBER(MID(AL1,2,500)*1)),RIGHT(AL1,LEN(AL1)-1)/2,(IF(ISNUMBER(AL1),AL1,\"\")))))","v":""},{"$f":"IF(AM1=\"n.n.\",0,(IF(AND(LEFT(AM1,1)=\"<\",ISNUMBER(MID(AM1,2,500)*1)),RIGHT(AM1,LEN(AM1)-1)/2,(IF(ISNUMBER(AM1),AM1,\"\")))))","v":""},{"$f":"IF(AN1=\"n.n.\",0,(IF(AND(LEFT(AN1,1)=\"<\",ISNUMBER(MID(AN1,2,500)*1)),RIGHT(AN1,LEN(AN1)-1)/2,(IF(ISNUMBER(AN1),AN1,\"\")))))","v":""},{"$f":"IF(AO1=\"n.n.\",0,(IF(AND(LEFT(AO1,1)=\"<\",ISNUMBER(MID(AO1,2,500)*1)),RIGHT(AO1,LEN(AO1)-1)/2,(IF(ISNUMBER(AO1),AO1,\"\")))))","v":""},{"$f":"IF(AP1=\"n.n.\",0,(IF(AND(LEFT(AP1,1)=\"<\",ISNUMBER(MID(AP1,2,500)*1)),RIGHT(AP1,LEN(AP1)-1)/2,(IF(ISNUMBER(AP1),AP1,\"\")))))","v":""},{"$f":"IF(AQ1=\"n.n.\",0,(IF(AND(LEFT(AQ1,1)=\"<\",ISNUMBER(MID(AQ1,2,500)*1)),RIGHT(AQ1,LEN(AQ1)-1)/2,(IF(ISNUMBER(AQ1),AQ1,\"\")))))","v":""},{"$f":"IF(AR1=\"n.n.\",0,(IF(AND(LEFT(AR1,1)=\"<\",ISNUMBER(MID(AR1,2,500)*1)),RIGHT(AR1,LEN(AR1)-1)/2,(IF(ISNUMBER(AR1),AR1,\"\")))))","v":""},{"$f":"IF(AS1=\"n.n.\",0,(IF(AND(LEFT(AS1,1)=\"<\",ISNUMBER(MID(AS1,2,500)*1)),RIGHT(AS1,LEN(AS1)-1)/2,(IF(ISNUMBER(AS1),AS1,\"\")))))","v":""},{"$f":"IF(AT1=\"n.n.\",0,(IF(AND(LEFT(AT1,1)=\"<\",ISNUMBER(MID(AT1,2,500)*1)),RIGHT(AT1,LEN(AT1)-1)/2,(IF(ISNUMBER(AT1),AT1,\"\")))))","v":""},{"$f":"IF(AU1=\"n.n.\",0,(IF(AND(LEFT(AU1,1)=\"<\",ISNUMBER(MID(AU1,2,500)*1)),RIGHT(AU1,LEN(AU1)-1)/2,(IF(ISNUMBER(AU1),AU1,\"\")))))","v":""},{"$f":"IF(AV1=\"n.n.\",0,(IF(AND(LEFT(AV1,1)=\"<\",ISNUMBER(MID(AV1,2,500)*1)),RIGHT(AV1,LEN(AV1)-1)/2,(IF(ISNUMBER(AV1),AV1,\"\")))))","v":""},{"$f":"IF(AW1=\"n.n.\",0,(IF(AND(LEFT(AW1,1)=\"<\",ISNUMBER(MID(AW1,2,500)*1)),RIGHT(AW1,LEN(AW1)-1)/2,(IF(ISNUMBER(AW1),AW1,\"\")))))","v":""},{"$f":"IF(AX1=\"n.n.\",0,(IF(AND(LEFT(AX1,1)=\"<\",ISNUMBER(MID(AX1,2,500)*1)),RIGHT(AX1,LEN(AX1)-1)/2,(IF(ISNUMBER(AX1),AX1,\"\")))))","v":""},{"$f":"IF(AY1=\"n.n.\",0,(IF(AND(LEFT(AY1,1)=\"<\",ISNUMBER(MID(AY1,2,500)*1)),RIGHT(AY1,LEN(AY1)-1)/2,(IF(ISNUMBER(AY1),AY1,\"\")))))","v":""},null,"Kopierte",3.4,"","","","","","","","","","","","","","","","","","","","","","","","","","","","","","","","","","","","","","","","","","","","","","","","","",null,null,1,3.4,"","","","","","","","","","","","","","","","","","","","","","","","","","","","","","","","","","","","","","","","","","","","","","","","",""]
[null,null,null,null,null,null,null,null,null,null,null,null,null,null,null,null,null,null,null,null,null,null,null,null,null,null,null,null,null,null,null,null,null,null,null,null,null,null,null,null,null,null,null,null,null,null,null,null,null,null,null,null,"n.n. und <",{"$f":"IF(B2=\"n.n.\",0,(IF(AND(LEFT(B2,1)=\"<\",ISNUMBER(MID(B2,2,500)*1)),RIGHT(B2,LEN(B2)-1)/2,(IF(ISNUMBER(B2),B2,\"\")))))","v":""},"","","","","","","","","","","","","","","","","","","","","","","","","","","","","","","","","","","","","","","","","","","","","","","","","",null,"Werte","","","","","","","","","","","","","","","","","","","","","","","","","","","","","","","","","","","","","","","","","","","","","","","","","","",null,null,2,"","","","","","","","","","","","","","","","","","","","","","","","","","","","","","","","","","","","","","","","","","","","","","","","","",""]
[null,null,null,null,null,null,null,null,null,null,null,null,null,null,null,null,null,null,null,null,null,null,null,null,null,null,null,null,null,null,null,null,null,null,null,null,null,null,null,null,null,null,null,null,null,null,null,null,null,null,null,null,null,"","","","","","","","","","","","","","","","","","","","","","","","","","","","","","","","","","","","","","","","","","","","","","","","","","",null,null,"","","","","","","","","","","","","","","","","","","","","","","","","","","","","","","","","","","","","","","","","","","","","","","","","","","",null,3,"","","","","","","","","","","","","","","","","","","","","","","","","","","","","","","","","","","","","","","","","","","","","","","","","",""]
[null,null,null,null,null,null,null,null,null,null,null,null,null,null,null,null,null,null,null,null,null,null,null,null,null,null,null,null,null,null,null,null,null,null,null,null,null,null,null,null,null,null,null,null,null,null,null,null,null,null,null,null,null,"","","","","","","","","","","","","","","","","","","","","","","","","","","","","","","","","","","","","","","","","","","","","","","","","","",null,null,"","","","","","","","","","","","","","","","","","","","","","","","","","","","","","","","","","","","","","","","","","","","","","","","","","","",null,4,"","","","","","","","","","","","","","","","","","","","","","","","","","","","","","","","","","","","","","","","","","","","","","","","","",""]
[null,null,null,null,null,null,null,null,null,null,null,null,null,null,null,null,null,null,null,null,null,null,null,null,null,null,null,null,null,null,null,null,null,null,null,null,null,null,null,null,null,null,null,null,null,null,null,null,null,null,null,null,null,"","","","","","","","","","","","","","","","","","","","","","","","","","","","","","","","","","","","","","","","","","","","","","","","","","",null,null,"","","","","","","","","","","","","","","","","","","","","","","","","","","","","","","","","","","","","","","","","","","","","","","","","","","",null,5,"","","","","","","","","","","","","","","","","","","","","","","","","","","","","","","","","","","","","","","","","","","","","","","","","",""]
[null,null,null,null,null,null,null,null,null,null,null,null,null,null,null,null,null,null,null,null,null,null,null,null,null,null,null,null,null,null,null,null,null,null,null,null,null,null,null,null,null,null,null,null,null,null,null,null,null,null,null,null,null,"","","","","","","","","","","","","","","","","","","","","","","","","","","","","","","","","","","","","","","","","","","","","","","","","","",null,null,"","","","","","","","","","","","","","","","","","","","","","","","","","","","","","","","","","","","","","","","","","","","","","","","","","","",null,6,"","","","","","","","","","","","","","","","","","","","","","","","","","","","","","","","","","","","","","","","","","","","","","","","","",""]
[null,null,null,null,null,null,null,null,null,null,null,null,null,null,null,null,null,null,null,null,null,null,null,null,null,null,null,null,null,null,null,null,null,null,null,null,null,null,null,null,null,null,null,null,null,null,null,null,null,null,null,null,null,"","","","","","","","","","","","","","","","","","","","","","","","","","","","","","","","","","","","","","","","","","","","","","","","","","",null,null,"","","","","","","","","","","","","","","","","","","","","","","","","","","","","","","","","","","","","","","","","","","","","","","","","","","",null,7,"","","","","","","","","","","","","","","","","","","","","","","","","","","","","","","","","","","","","","","","","","","","","","","","","",""]
[null,null,null,null,null,null,null,null,null,null,null,null,null,null,null,null,null,null,null,null,null,null,null,null,null,null,null,null,null,null,null,null,null,null,null,null,null,null,null,null,null,null,null,null,null,null,null,null,null,null,null,null,null,"","","","","","","","","","","","","","","","","","","","","","","","","","","","","","","","","","","","","","","","","","","","","","","","","","",null,null,"","","","","","","","","","","","","","","","","","","","","","","","","","","","","","","","","","","","","","","","","","","","","","","","","","","",null,8,"","","","","","","","","","","","","","","","","","","","","","","","","","","","","","","","","","","","","","","","","","","","","","","","","",""]
[null,null,null,null,null,null,null,null,null,null,null,null,null,null,null,null,null,null,null,null,null,null,null,null,null,null,null,null,null,null,null,null,null,null,null,null,null,null,null,null,null,null,null,null,null,null,null,null,null,null,null,null,null,"","","","","","","","","","","","","","","","","","","","","","","","","","","","","","","","","","","","","","","","","","","","","","","","","","",null,null,"","","","","","","","","","","","","","","","","","","","","","","","","","","","","","","","","","","","","","","","","","","","","","","","","","","",null,9,"","","","","","","","","","","","","","","","","","","","","","","","","","","","","","","","","","","","","","","","","","","","","","","","","",""]
[null,null,null,null,null,null,null,null,null,null,null,null,null,null,null,null,null,null,null,null,null,null,null,null,null,null,null,null,null,null,null,null,null,null,null,null,null,null,null,null,null,null,null,null,null,null,null,null,null,null,null,null,null,{"$f":"IF(B10=\"n.n.\",0,(IF(AND(LEFT(B10,1)=\"<\",ISNUMBER(MID(B10,2,500)*1)),RIGHT(B10,LEN(B10)-1)/2,(IF(ISNUMBER(B10),B10,\"\")))))","v":""},{"$f":"IF(C10=\"n.n.\",0,(IF(AND(LEFT(C10,1)=\"<\",ISNUMBER(MID(C10,2,500)*1)),RIGHT(C10,LEN(C10)-1)/2,(IF(ISNUMBER(C10),C10,\"\")))))","v":""},{"$f":"IF(D10=\"n.n.\",0,(IF(AND(LEFT(D10,1)=\"<\",ISNUMBER(MID(D10,2,500)*1)),RIGHT(D10,LEN(D10)-1)/2,(IF(ISNUMBER(D10),D10,\"\")))))","v":""},{"$f":"IF(E10=\"n.n.\",0,(IF(AND(LEFT(E10,1)=\"<\",ISNUMBER(MID(E10,2,500)*1)),RIGHT(E10,LEN(E10)-1)/2,(IF(ISNUMBER(E10),E10,\"\")))))","v":""},{"$f":"IF(F10=\"n.n.\",0,(IF(AND(LEFT(F10,1)=\"<\",ISNUMBER(MID(F10,2,500)*1)),RIGHT(F10,LEN(F10)-1)/2,(IF(ISNUMBER(F10),F10,\"\")))))","v":""},{"$f":"IF(G10=\"n.n.\",0,(IF(AND(LEFT(G10,1)=\"<\",ISNUMBER(MID(G10,2,500)*1)),RIGHT(G10,LEN(G10)-1)/2,(IF(ISNUMBER(G10),G10,\"\")))))","v":""},{"$f":"IF(H10=\"n.n.\",0,(IF(AND(LEFT(H10,1)=\"<\",ISNUMBER(MID(H10,2,500)*1)),RIGHT(H10,LEN(H10)-1)/2,(IF(ISNUMBER(H10),H10,\"\")))))","v":""},{"$f":"IF(I10=\"n.n.\",0,(IF(AND(LEFT(I10,1)=\"<\",ISNUMBER(MID(I10,2,500)*1)),RIGHT(I10,LEN(I10)-1)/2,(IF(ISNUMBER(I10),I10,\"\")))))","v":""},{"$f":"IF(J10=\"n.n.\",0,(IF(AND(LEFT(J10,1)=\"<\",ISNUMBER(MID(J10,2,500)*1)),RIGHT(J10,LEN(J10)-1)/2,(IF(ISNUMBER(J10),J10,\"\")))))","v":""},{"$f":"IF(K10=\"n.n.\",0,(IF(AND(LEFT(K10,1)=\"<\",ISNUMBER(MID(K10,2,500)*1)),RIGHT(K10,LEN(K10)-1)/2,(IF(ISNUMBER(K10),K10,\"\")))))","v":""},{"$f":"IF(L10=\"n.n.\",0,(IF(AND(LEFT(L10,1)=\"<\",ISNUMBER(MID(L10,2,500)*1)),RIGHT(L10,LEN(L10)-1)/2,(IF(ISNUMBER(L10),L10,\"\")))))","v":""},{"$f":"IF(M10=\"n.n.\",0,(IF(AND(LEFT(M10,1)=\"<\",ISNUMBER(MID(M10,2,500)*1)),RIGHT(M10,LEN(M10)-1)/2,(IF(ISNUMBER(M10),M10,\"\")))))","v":""},{"$f":"IF(N10=\"n.n.\",0,(IF(AND(LEFT(N10,1)=\"<\",ISNUMBER(MID(N10,2,500)*1)),RIGHT(N10,LEN(N10)-1)/2,(IF(ISNUMBER(N10),N10,\"\")))))","v":""},{"$f":"IF(O10=\"n.n.\",0,(IF(AND(LEFT(O10,1)=\"<\",ISNUMBER(MID(O10,2,500)*1)),RIGHT(O10,LEN(O10)-1)/2,(IF(ISNUMBER(O10),O10,\"\")))))","v":""},{"$f":"IF(P10=\"n.n.\",0,(IF(AND(LEFT(P10,1)=\"<\",ISNUMBER(MID(P10,2,500)*1)),RIGHT(P10,LEN(P10)-1)/2,(IF(ISNUMBER(P10),P10,\"\")))))","v":""},{"$f":"IF(Q10=\"n.n.\",0,(IF(AND(LEFT(Q10,1)=\"<\",ISNUMBER(MID(Q10,2,500)*1)),RIGHT(Q10,LEN(Q10)-1)/2,(IF(ISNUMBER(Q10),Q10,\"\")))))","v":""},{"$f":"IF(R10=\"n.n.\",0,(IF(AND(LEFT(R10,1)=\"<\",ISNUMBER(MID(R10,2,500)*1)),RIGHT(R10,LEN(R10)-1)/2,(IF(ISNUMBER(R10),R10,\"\")))))","v":""},{"$f":"IF(S10=\"n.n.\",0,(IF(AND(LEFT(S10,1)=\"<\",ISNUMBER(MID(S10,2,500)*1)),RIGHT(S10,LEN(S10)-1)/2,(IF(ISNUMBER(S10),S10,\"\")))))","v":""},{"$f":"IF(T10=\"n.n.\",0,(IF(AND(LEFT(T10,1)=\"<\",ISNUMBER(MID(T10,2,500)*1)),RIGHT(T10,LEN(T10)-1)/2,(IF(ISNUMBER(T10),T10,\"\")))))","v":""},{"$f":"IF(U10=\"n.n.\",0,(IF(AND(LEFT(U10,1)=\"<\",ISNUMBER(MID(U10,2,500)*1)),RIGHT(U10,LEN(U10)-1)/2,(IF(ISNUMBER(U10),U10,\"\")))))","v":""},{"$f":"IF(V10=\"n.n.\",0,(IF(AND(LEFT(V10,1)=\"<\",ISNUMBER(MID(V10,2,500)*1)),RIGHT(V10,LEN(V10)-1)/2,(IF(ISNUMBER(V10),V10,\"\")))))","v":""},{"$f":"IF(W10=\"n.n.\",0,(IF(AND(LEFT(W10,1)=\"<\",ISNUMBER(MID(W10,2,500)*1)),RIGHT(W10,LEN(W10)-1)/2,(IF(ISNUMBER(W10),W10,\"\")))))","v":""},{"$f":"IF(X10=\"n.n.\",0,(IF(AND(LEFT(X10,1)=\"<\",ISNUMBER(MID(X10,2,500)*1)),RIGHT(X10,LEN(X10)-1)/2,(IF(ISNUMBER(X10),X10,\"\")))))","v":""},{"$f":"IF(Y10=\"n.n.\",0,(IF(AND(LEFT(Y10,1)=\"<\",ISNUMBER(MID(Y10,2,500)*1)),RIGHT(Y10,LEN(Y10)-1)/2,(IF(ISNUMBER(Y10),Y10,\"\")))))","v":""},{"$f":"IF(Z10=\"n.n.\",0,(IF(AND(LEFT(Z10,1)=\"<\",ISNUMBER(MID(Z10,2,500)*1)),RIGHT(Z10,LEN(Z10)-1)/2,(IF(ISNUMBER(Z10),Z10,\"\")))))","v":""},{"$f":"IF(AA10=\"n.n.\",0,(IF(AND(LEFT(AA10,1)=\"<\",ISNUMBER(MID(AA10,2,500)*1)),RIGHT(AA10,LEN(AA10)-1)/2,(IF(ISNUMBER(AA10),AA10,\"\")))))","v":""},{"$f":"IF(AB10=\"n.n.\",0,(IF(AND(LEFT(AB10,1)=\"<\",ISNUMBER(MID(AB10,2,500)*1)),RIGHT(AB10,LEN(AB10)-1)/2,(IF(ISNUMBER(AB10),AB10,\"\")))))","v":""},{"$f":"IF(AC10=\"n.n.\",0,(IF(AND(LEFT(AC10,1)=\"<\",ISNUMBER(MID(AC10,2,500)*1)),RIGHT(AC10,LEN(AC10)-1)/2,(IF(ISNUMBER(AC10),AC10,\"\")))))","v":""},{"$f":"IF(AD10=\"n.n.\",0,(IF(AND(LEFT(AD10,1)=\"<\",ISNUMBER(MID(AD10,2,500)*1)),RIGHT(AD10,LEN(AD10)-1)/2,(IF(ISNUMBER(AD10),AD10,\"\")))))","v":""},{"$f":"IF(AE10=\"n.n.\",0,(IF(AND(LEFT(AE10,1)=\"<\",ISNUMBER(MID(AE10,2,500)*1)),RIGHT(AE10,LEN(AE10)-1)/2,(IF(ISNUMBER(AE10),AE10,\"\")))))","v":""},{"$f":"IF(AF10=\"n.n.\",0,(IF(AND(LEFT(AF10,1)=\"<\",ISNUMBER(MID(AF10,2,500)*1)),RIGHT(AF10,LEN(AF10)-1)/2,(IF(ISNUMBER(AF10),AF10,\"\")))))","v":""},{"$f":"IF(AG10=\"n.n.\",0,(IF(AND(LEFT(AG10,1)=\"<\",ISNUMBER(MID(AG10,2,500)*1)),RIGHT(AG10,LEN(AG10)-1)/2,(IF(ISNUMBER(AG10),AG10,\"\")))))","v":""},{"$f":"IF(AH10=\"n.n.\",0,(IF(AND(LEFT(AH10,1)=\"<\",ISNUMBER(MID(AH10,2,500)*1)),RIGHT(AH10,LEN(AH10)-1)/2,(IF(ISNUMBER(AH10),AH10,\"\")))))","v":""},{"$f":"IF(AI10=\"n.n.\",0,(IF(AND(LEFT(AI10,1)=\"<\",ISNUMBER(MID(AI10,2,500)*1)),RIGHT(AI10,LEN(AI10)-1)/2,(IF(ISNUMBER(AI10),AI10,\"\")))))","v":""},{"$f":"IF(AJ10=\"n.n.\",0,(IF(AND(LEFT(AJ10,1)=\"<\",ISNUMBER(MID(AJ10,2,500)*1)),RIGHT(AJ10,LEN(AJ10)-1)/2,(IF(ISNUMBER(AJ10),AJ10,\"\")))))","v":""},{"$f":"IF(AK10=\"n.n.\",0,(IF(AND(LEFT(AK10,1)=\"<\",ISNUMBER(MID(AK10,2,500)*1)),RIGHT(AK10,LEN(AK10)-1)/2,(IF(ISNUMBER(AK10),AK10,\"\")))))","v":""},{"$f":"IF(AL10=\"n.n.\",0,(IF(AND(LEFT(AL10,1)=\"<\",ISNUMBER(MID(AL10,2,500)*1)),RIGHT(AL10,LEN(AL10)-1)/2,(IF(ISNUMBER(AL10),AL10,\"\")))))","v":""},{"$f":"IF(AM10=\"n.n.\",0,(IF(AND(LEFT(AM10,1)=\"<\",ISNUMBER(MID(AM10,2,500)*1)),RIGHT(AM10,LEN(AM10)-1)/2,(IF(ISNUMBER(AM10),AM10,\"\")))))","v":""},{"$f":"IF(AN10=\"n.n.\",0,(IF(AND(LEFT(AN10,1)=\"<\",ISNUMBER(MID(AN10,2,500)*1)),RIGHT(AN10,LEN(AN10)-1)/2,(IF(ISNUMBER(AN10),AN10,\"\")))))","v":""},{"$f":"IF(AO10=\"n.n.\",0,(IF(AND(LEFT(AO10,1)=\"<\",ISNUMBER(MID(AO10,2,500)*1)),RIGHT(AO10,LEN(AO10)-1)/2,(IF(ISNUMBER(AO10),AO10,\"\")))))","v":""},{"$f":"IF(AP10=\"n.n.\",0,(IF(AND(LEFT(AP10,1)=\"<\",ISNUMBER(MID(AP10,2,500)*1)),RIGHT(AP10,LEN(AP10)-1)/2,(IF(ISNUMBER(AP10),AP10,\"\")))))","v":""},{"$f":"IF(AQ10=\"n.n.\",0,(IF(AND(LEFT(AQ10,1)=\"<\",ISNUMBER(MID(AQ10,2,500)*1)),RIGHT(AQ10,LEN(AQ10)-1)/2,(IF(ISNUMBER(AQ10),AQ10,\"\")))))","v":""},{"$f":"IF(AR10=\"n.n.\",0,(IF(AND(LEFT(AR10,1)=\"<\",ISNUMBER(MID(AR10,2,500)*1)),RIGHT(AR10,LEN(AR10)-1)/2,(IF(ISNUMBER(AR10),AR10,\"\")))))","v":""},{"$f":"IF(AS10=\"n.n.\",0,(IF(AND(LEFT(AS10,1)=\"<\",ISNUMBER(MID(AS10,2,500)*1)),RIGHT(AS10,LEN(AS10)-1)/2,(IF(ISNUMBER(AS10),AS10,\"\")))))","v":""},{"$f":"IF(AT10=\"n.n.\",0,(IF(AND(LEFT(AT10,1)=\"<\",ISNUMBER(MID(AT10,2,500)*1)),RIGHT(AT10,LEN(AT10)-1)/2,(IF(ISNUMBER(AT10),AT10,\"\")))))","v":""},{"$f":"IF(AU10=\"n.n.\",0,(IF(AND(LEFT(AU10,1)=\"<\",ISNUMBER(MID(AU10,2,500)*1)),RIGHT(AU10,LEN(AU10)-1)/2,(IF(ISNUMBER(AU10),AU10,\"\")))))","v":""},{"$f":"IF(AV10=\"n.n.\",0,(IF(AND(LEFT(AV10,1)=\"<\",ISNUMBER(MID(AV10,2,500)*1)),RIGHT(AV10,LEN(AV10)-1)/2,(IF(ISNUMBER(AV10),AV10,\"\")))))","v":""},{"$f":"IF(AW10=\"n.n.\",0,(IF(AND(LEFT(AW10,1)=\"<\",ISNUMBER(MID(AW10,2,500)*1)),RIGHT(AW10,LEN(AW10)-1)/2,(IF(ISNUMBER(AW10),AW10,\"\")))))","v":""},{"$f":"IF(AX10=\"n.n.\",0,(IF(AND(LEFT(AX10,1)=\"<\",ISNUMBER(MID(AX10,2,500)*1)),RIGHT(AX10,LEN(AX10)-1)/2,(IF(ISNUMBER(AX10),AX10,\"\")))))","v":""},{"$f":"IF(AY10=\"n.n.\",0,(IF(AND(LEFT(AY10,1)=\"<\",ISNUMBER(MID(AY10,2,500)*1)),RIGHT(AY10,LEN(AY10)-1)/2,(IF(ISNUMBER(AY10),AY10,\"\")))))","v":""},null,null,"","","","","","","","","","","","","","","","","","","","","","","","","","","","","","","","","","","","","","","","","","","","","","","","","","",null,null,10,"","","","","","","","","","","","","","","","","","","","","","","","","","","","","","","","","","","","","","","","","","","","","","","","","",""]
[]
[]
[null,null,null,null,null,null,null,null,null,null,null,null,null,null,null,null,null,null,null,null,null,null,null,null,null,null,null,null,null,null,null,null,null,null,null,null,null,null,null,null,null,null,null,null,null,null,null,null,null,null,null,null,null,null,null,null,null,null,null,null,null,null,null,null,null,null,null,null,null,null,null,null,null,null,null,null,null,null,null,null,null,null,null,null,null,null,null,null,null,null,null,null,null,null,null,null,null,null,null,null,null,null,null,null,null,null,null,null,null,null,null,null,null,null,null,null,null,null,null,null,null,null,null,null,null,null,null,null,null,null,null,null,null,null,null,null,null,null,null,null,null,null,null,null,null,null,null,null,null,null,null,null,null,null,null,null,null,"Parameter",1,2,3,4,5,6,7,8,9,10,11,12,13,14,15,16,17,18,19,20,21,22,23,24,25,26,27,28,29,30,31,32,33,34,35,36,37,38,39,40,41,42,43,44,45,46,47,48,49,50]
[]
[null,null,null,null,null,null,null,null,null,null,null,null,null,null,null,null,null,null,null,null,null,null,null,null,null,null,null,null,null,null,null,null,null,null,null,null,null,null,null,null,null,null,null,null,null,null,null,null,null,null,null,null,null,null,null,null,null,null,null,null,null,null,null,null,null,null,null,null,null,null,null,null,null,null,null,null,null,null,null,null,null,null,null,null,null,null,null,null,null,null,null,null,null,null,null,null,null,null,null,null,null,null,null,null,null,null,null,null,null,null,null,null,null,null,null,null,null,null,null,null,null,null,null,null,null,null,null,null,null,null,null,null,null,null,null,null,null,null,null,null,null,null,null,null,null,null,null,null,null,null,null,null,null,null,null,null,null,"Anzahl",{"$f":"COUNT(FC1:FC10)","v":1},{"$f":"COUNT(FD1:FD10)","v":0},0,0,0,0,0,0,0,0,0,0,0,0,0,0,0,0,0,0,0,0,0,0,0,0,0,0,0,0,0,0,0,0,0,0,0,0,0,0,0,0,0,0,0,0,0,0,0,0]
[]
[null,null,null,null,null,null,null,null,null,null,null,null,null,null,null,null,null,null,null,null,null,null,null,null,null,null,null,null,null,null,null,null,null,null,null,null,null,null,null,null,null,null,null,null,null,null,null,null,null,null,null,null,null,null,null,null,null,null,null,null,null,null,null,null,null,null,null,null,null,null,null,null,null,null,null,null,null,null,null,null,null,null,null,null,null,null,null,null,null,null,null,null,null,null,null,null,null,null,null,null,null,null,null,null,null,null,null,null,null,null,null,null,null,null,null,null,null,null,null,null,null,null,null,null,null,null,null,null,null,null,null,null,null,null,null,null,null,null,null,null,null,null,null,null,null,null,null,null,null,null,null,null,null,null,null,null,null,"50P.UG",{"$f":"VLOOKUP((ROUNDUP(FC15*0.5, 0)),$FB1:FC10,FC13+1)","v":3.4},{"$f":"VLOOKUP((ROUNDUP(FD15*0.5, 0)),$FB1:FD10,FD13+1)","v":{"$error":"#N/A"}},{"$f":"VLOOKUP((ROUNDUP(FE15*0.5, 0)),$FB1:FE10,FE13+1)","v":{"$error":"#N/A"}},{"$f":"VLOOKUP((ROUNDUP(FF15*0.5, 0)),$FB1:FF10,FF13+1)","v":{"$error":"#N/A"}},{"$f":"VLOOKUP((ROUNDUP(FG15*0.5, 0)),$FB1:FG10,FG13+1)","v":{"$error":"#N/A"}},{"$f":"VLOOKUP((ROUNDUP(FH15*0.5, 0)),$FB1:FH10,FH13+1)","v":{"$error":"#N/A"}},{"$f":"VLOOKUP((ROUNDUP(FI15*0.5, 0)),$FB1:FI10,FI13+1)","v":{"$error":"#N/A"}},{"$f":"VLOOKUP((ROUNDUP(FJ15*0.5, 0)),$FB1:FJ10,FJ13+1)","v":{"$error":"#N/A"}},{"$f":"VLOOKUP((ROUNDUP(FK15*0.5, 0)),$FB1:FK10,FK13+1)","v":{"$error":"#N/A"}},{"$f":"VLOOKUP((ROUNDUP(FL15*0.5, 0)),$FB1:FL10,FL13+1)","v":{"$error":"#N/A"}},{"$f":"VLOOKUP((ROUNDUP(FM15*0.5, 0)),$FB1:FM10,FM13+1)","v":{"$error":"#N/A"}},{"$f":"VLOOKUP((ROUNDUP(FN15*0.5, 0)),$FB1:FN10,FN13+1)","v":{"$error":"#N/A"}},{"$f":"VLOOKUP((ROUNDUP(FO15*0.5, 0)),$FB1:FO10,FO13+1)","v":{"$error":"#N/A"}},{"$f":"VLOOKUP((ROUNDUP(FP15*0.5, 0)),$FB1:FP10,FP13+1)","v":{"$error":"#N/A"}},{"$f":"VLOOKUP((ROUNDUP(FQ15*0.5, 0)),$FB1:FQ10,FQ13+1)","v":{"$error":"#N/A"}},{"$f":"VLOOKUP((ROUNDUP(FR15*0.5, 0)),$FB1:FR10,FR13+1)","v":{"$error":"#N/A"}},{"$f":"VLOOKUP((ROUNDUP(FS15*0.5, 0)),$FB1:FS10,FS13+1)","v":{"$error":"#N/A"}},{"$f":"VLOOKUP((ROUNDUP(FT15*0.5, 0)),$FB1:FT10,FT13+1)","v":{"$error":"#N/A"}},{"$f":"VLOOKUP((ROUNDUP(FU15*0.5, 0)),$FB1:FU10,FU13+1)","v":{"$error":"#N/A"}},{"$f":"VLOOKUP((ROUNDUP(FV15*0.5, 0)),$FB1:FV10,FV13+1)","v":{"$error":"#N/A"}},{"$f":"VLOOKUP((ROUNDUP(FW15*0.5, 0)),$FB1:FW10,FW13+1)","v":{"$error":"#N/A"}},{"$f":"VLOOKUP((ROUNDUP(FX15*0.5, 0)),$FB1:FX10,FX13+1)","v":{"$error":"#N/A"}},{"$f":"VLOOKUP((ROUNDUP(FY15*0.5, 0)),$FB1:FY10,FY13+1)","v":{"$error":"#N/A"}},{"$f":"VLOOKUP((ROUNDUP(FZ15*0.5, 0)),$FB1:FZ10,FZ13+1)","v":{"$error":"#N/A"}},{"$f":"VLOOKUP((ROUNDUP(GA15*0.5, 0)),$FB1:GA10,GA13+1)","v":{"$error":"#N/A"}},{"$f":"VLOOKUP((ROUNDUP(GB15*0.5, 0)),$FB1:GB10,GB13+1)","v":{"$error":"#N/A"}},{"$f":"VLOOKUP((ROUNDUP(GC15*0.5, 0)),$FB1:GC10,GC13+1)","v":{"$error":"#N/A"}},{"$f":"VLOOKUP((ROUNDUP(GD15*0.5, 0)),$FB1:GD10,GD13+1)","v":{"$error":"#N/A"}},{"$f":"VLOOKUP((ROUNDUP(GE15*0.5, 0)),$FB1:GE10,GE13+1)","v":{"$error":"#N/A"}},{"$f":"VLOOKUP((ROUNDUP(GF15*0.5, 0)),$FB1:GF10,GF13+1)","v":{"$error":"#N/A"}},{"$f":"VLOOKUP((ROUNDUP(GG15*0.5, 0)),$FB1:GG10,GG13+1)","v":{"$error":"#N/A"}},{"$f":"VLOOKUP((ROUNDUP(GH15*0.5, 0)),$FB1:GH10,GH13+1)","v":{"$error":"#N/A"}},{"$f":"VLOOKUP((ROUNDUP(GI15*0.5, 0)),$FB1:GI10,GI13+1)","v":{"$error":"#N/A"}},{"$f":"VLOOKUP((ROUNDUP(GJ15*0.5, 0)),$FB1:GJ10,GJ13+1)","v":{"$error":"#N/A"}},{"$f":"VLOOKUP((ROUNDUP(GK15*0.5, 0)),$FB1:GK10,GK13+1)","v":{"$error":"#N/A"}},{"$f":"VLOOKUP((ROUNDUP(GL15*0.5, 0)),$FB1:GL10,GL13+1)","v":{"$error":"#N/A"}},{"$f":"VLOOKUP((ROUNDUP(GM15*0.5, 0)),$FB1:GM10,GM13+1)","v":{"$error":"#N/A"}},{"$f":"VLOOKUP((ROUNDUP(GN15*0.5, 0)),$FB1:GN10,GN13+1)","v":{"$error":"#N/A"}},{"$f":"VLOOKUP((ROUNDUP(GO15*0.5, 0)),$FB1:GO10,GO13+1)","v":{"$error":"#N/A"}},{"$f":"VLOOKUP((ROUNDUP(GP15*0.5, 0)),$FB1:GP10,GP13+1)","v":{"$error":"#N/A"}},{"$f":"VLOOKUP((ROUNDUP(GQ15*0.5, 0)),$FB1:GQ10,GQ13+1)","v":{"$error":"#N/A"}},{"$f":"VLOOKUP((ROUNDUP(GR15*0.5, 0)),$FB1:GR10,GR13+1)","v":{"$error":"#N/A"}},{"$f":"VLOOKUP((ROUNDUP(GS15*0.5, 0)),$FB1:GS10,GS13+1)","v":{"$error":"#N/A"}},{"$f":"VLOOKUP((ROUNDUP(GT15*0.5, 0)),$FB1:GT10,GT13+1)","v":{"$error":"#N/A"}},{"$f":"VLOOKUP((ROUNDUP(GU15*0.5, 0)),$FB1:GU10,GU13+1)","v":{"$error":"#N/A"}},{"$f":"VLOOKUP((ROUNDUP(GV15*0.5, 0)),$FB1:GV10,GV13+1)","v":{"$error":"#N/A"}},{"$f":"VLOOKUP((ROUNDUP(GW15*0.5, 0)),$FB1:GW10,GW13+1)","v":{"$error":"#N/A"}},{"$f":"VLOOKUP((ROUNDUP(GX15*0.5, 0)),$FB1:GX10,GX13+1)","v":{"$error":"#N/A"}},{"$f":"VLOOKUP((ROUNDUP(GY15*0.5, 0)),$FB1:GY10,GY13+1)","v":{"$error":"#N/A"}},{"$f":"VLOOKUP((ROUNDUP(GZ15*0.5, 0)),$FB1:GZ10,GZ13+1)","v":{"$error":"#N/A"}}]
[null,null,null,null,null,null,null,null,null,null,null,null,null,null,null,null,null,null,null,null,null,null,null,null,null,null,null,null,null,null,null,null,null,null,null,null,null,null,null,null,null,null,null,null,null,null,null,null,null,null,null,null,null,null,null,null,null,null,null,null,null,null,null,null,null,null,null,null,null,null,null,null,null,null,null,null,null,null,null,null,null,null,null,null,null,null,null,null,null,null,null,null,null,null,null,null,null,null,null,null,null,null,null,null,null,null,null,null,null,null,null,null,null,null,null,null,null,null,null,null,null,null,null,null,null,null,null,null,null,null,null,null,null,null,null,null,null,null,null,null,null,null,null,null,null,null,null,null,null,null,null,null,null,null,null,null,null,"50P.OG",{"$f":"VLOOKUP((ROUNDDOWN(FC15*0.5+1, 0)),$FB1:FC10,FC13+1)","v":3.4},{"$f":"VLOOKUP((ROUNDDOWN(FD15*0.5+1, 0)),$FB1:FD10,FD13+1)","v":""},{"$f":"VLOOKUP((ROUNDDOWN(FE15*0.5+1, 0)),$FB1:FE10,FE13+1)","v":""},{"$f":"VLOOKUP((ROUNDDOWN(FF15*0.5+1, 0)),$FB1:FF10,FF13+1)","v":""},{"$f":"VLOOKUP((ROUNDDOWN(FG15*0.5+1, 0)),$FB1:FG10,FG13+1)","v":""},{"$f":"VLOOKUP((ROUNDDOWN(FH15*0.5+1, 0)),$FB1:FH10,FH13+1)","v":""},{"$f":"VLOOKUP((ROUNDDOWN(FI15*0.5+1, 0)),$FB1:FI10,FI13+1)","v":""},{"$f":"VLOOKUP((ROUNDDOWN(FJ15*0.5+1, 0)),$FB1:FJ10,FJ13+1)","v":""},{"$f":"VLOOKUP((ROUNDDOWN(FK15*0.5+1, 0)),$FB1:FK10,FK13+1)","v":""},{"$f":"VLOOKUP((ROUNDDOWN(FL15*0.5+1, 0)),$FB1:FL10,FL13+1)","v":""},{"$f":"VLOOKUP((ROUNDDOWN(FM15*0.5+1, 0)),$FB1:FM10,FM13+1)","v":""},{"$f":"VLOOKUP((ROUNDDOWN(FN15*0.5+1, 0)),$FB1:FN10,FN13+1)","v":""},{"$f":"VLOOKUP((ROUNDDOWN(FO15*0.5+1, 0)),$FB1:FO10,FO13+1)","v":""},{"$f":"VLOOKUP((ROUNDDOWN(FP15*0.5+1, 0)),$FB1:FP10,FP13+1)","v":""},{"$f":"VLOOKUP((ROUNDDOWN(FQ15*0.5+1, 0)),$FB1:FQ10,FQ13+1)","v":""},{"$f":"VLOOKUP((ROUNDDOWN(FR15*0.5+1, 0)),$FB1:FR10,FR13+1)","v":""},{"$f":"VLOOKUP((ROUNDDOWN(FS15*0.5+1, 0)),$FB1:FS10,FS13+1)","v":""},{"$f":"VLOOKUP((ROUNDDOWN(FT15*0.5+1, 0)),$FB1:FT10,FT13+1)","v":""},{"$f":"VLOOKUP((ROUNDDOWN(FU15*0.5+1, 0)),$FB1:FU10,FU13+1)","v":""},{"$f":"VLOOKUP((ROUNDDOWN(FV15*0.5+1, 0)),$FB1:FV10,FV13+1)","v":""},{"$f":"VLOOKUP((ROUNDDOWN(FW15*0.5+1, 0)),$FB1:FW10,FW13+1)","v":""},{"$f":"VLOOKUP((ROUNDDOWN(FX15*0.5+1, 0)),$FB1:FX10,FX13+1)","v":""},{"$f":"VLOOKUP((ROUNDDOWN(FY15*0.5+1, 0)),$FB1:FY10,FY13+1)","v":""},{"$f":"VLOOKUP((ROUNDDOWN(FZ15*0.5+1, 0)),$FB1:FZ10,FZ13+1)","v":""},{"$f":"VLOOKUP((ROUNDDOWN(GA15*0.5+1, 0)),$FB1:GA10,GA13+1)","v":""},{"$f":"VLOOKUP((ROUNDDOWN(GB15*0.5+1, 0)),$FB1:GB10,GB13+1)","v":""},{"$f":"VLOOKUP((ROUNDDOWN(GC15*0.5+1, 0)),$FB1:GC10,GC13+1)","v":""},{"$f":"VLOOKUP((ROUNDDOWN(GD15*0.5+1, 0)),$FB1:GD10,GD13+1)","v":""},{"$f":"VLOOKUP((ROUNDDOWN(GE15*0.5+1, 0)),$FB1:GE10,GE13+1)","v":""},{"$f":"VLOOKUP((ROUNDDOWN(GF15*0.5+1, 0)),$FB1:GF10,GF13+1)","v":""},{"$f":"VLOOKUP((ROUNDDOWN(GG15*0.5+1, 0)),$FB1:GG10,GG13+1)","v":""},{"$f":"VLOOKUP((ROUNDDOWN(GH15*0.5+1, 0)),$FB1:GH10,GH13+1)","v":""},{"$f":"VLOOKUP((ROUNDDOWN(GI15*0.5+1, 0)),$FB1:GI10,GI13+1)","v":""},{"$f":"VLOOKUP((ROUNDDOWN(GJ15*0.5+1, 0)),$FB1:GJ10,GJ13+1)","v":""},{"$f":"VLOOKUP((ROUNDDOWN(GK15*0.5+1, 0)),$FB1:GK10,GK13+1)","v":""},{"$f":"VLOOKUP((ROUNDDOWN(GL15*0.5+1, 0)),$FB1:GL10,GL13+1)","v":""},{"$f":"VLOOKUP((ROUNDDOWN(GM15*0.5+1, 0)),$FB1:GM10,GM13+1)","v":""},{"$f":"VLOOKUP((ROUNDDOWN(GN15*0.5+1, 0)),$FB1:GN10,GN13+1)","v":""},{"$f":"VLOOKUP((ROUNDDOWN(GO15*0.5+1, 0)),$FB1:GO10,GO13+1)","v":""},{"$f":"VLOOKUP((ROUNDDOWN(GP15*0.5+1, 0)),$FB1:GP10,GP13+1)","v":""},{"$f":"VLOOKUP((ROUNDDOWN(GQ15*0.5+1, 0)),$FB1:GQ10,GQ13+1)","v":""},{"$f":"VLOOKUP((ROUNDDOWN(GR15*0.5+1, 0)),$FB1:GR10,GR13+1)","v":""},{"$f":"VLOOKUP((ROUNDDOWN(GS15*0.5+1, 0)),$FB1:GS10,GS13+1)","v":""},{"$f":"VLOOKUP((ROUNDDOWN(GT15*0.5+1, 0)),$FB1:GT10,GT13+1)","v":""},{"$f":"VLOOKUP((ROUNDDOWN(GU15*0.5+1, 0)),$FB1:GU10,GU13+1)","v":""},{"$f":"VLOOKUP((ROUNDDOWN(GV15*0.5+1, 0)),$FB1:GV10,GV13+1)","v":""},{"$f":"VLOOKUP((ROUNDDOWN(GW15*0.5+1, 0)),$FB1:GW10,GW13+1)","v":""},{"$f":"VLOOKUP((ROUNDDOWN(GX15*0.5+1, 0)),$FB1:GX10,GX13+1)","v":""},{"$f":"VLOOKUP((ROUNDDOWN(GY15*0.5+1, 0)),$FB1:GY10,GY13+1)","v":""},{"$f":"VLOOKUP((ROUNDDOWN(GZ15*0.5+1, 0)),$FB1:GZ10,GZ13+1)","v":""}]
[]
[null,null,null,null,null,null,null,null,null,null,null,null,null,null,null,null,null,null,null,null,null,null,null,null,null,null,null,null,null,null,null,null,null,null,null,null,null,null,null,null,null,null,null,null,null,null,null,null,null,null,null,null,null,null,null,null,null,null,null,null,null,null,null,null,null,null,null,null,null,null,null,null,null,null,null,null,null,null,null,null,null,null,null,null,null,null,null,null,null,null,null,null,null,null,null,null,null,null,null,null,null,null,null,null,null,null,null,null,null,null,null,null,null,null,null,null,null,null,null,null,null,null,null,null,null,null,null,null,null,null,null,null,null,null,null,null,null,null,null,null,null,null,null,null,null,null,null,null,null,null,null,null,null,null,null,null,null,"80P.UG",{"$f":"VLOOKUP((ROUNDUP(FC15*0.8, 0)),$FB1:FC10,FC13+1)","v":3.4},{"$f":"VLOOKUP((ROUNDUP(FD15*0.8, 0)),$FB1:FD10,FD13+1)","v":{"$error":"#N/A"}},{"$f":"VLOOKUP((ROUNDUP(FE15*0.8, 0)),$FB1:FE10,FE13+1)","v":{"$error":"#N/A"}},{"$f":"VLOOKUP((ROUNDUP(FF15*0.8, 0)),$FB1:FF10,FF13+1)","v":{"$error":"#N/A"}},{"$f":"VLOOKUP((ROUNDUP(FG15*0.8, 0)),$FB1:FG10,FG13+1)","v":{"$error":"#N/A"}},{"$f":"VLOOKUP((ROUNDUP(FH15*0.8, 0)),$FB1:FH10,FH13+1)","v":{"$error":"#N/A"}},{"$f":"VLOOKUP((ROUNDUP(FI15*0.8, 0)),$FB1:FI10,FI13+1)","v":{"$error":"#N/A"}},{"$f":"VLOOKUP((ROUNDUP(FJ15*0.8, 0)),$FB1:FJ10,FJ13+1)","v":{"$error":"#N/A"}},{"$f":"VLOOKUP((ROUNDUP(FK15*0.8, 0)),$FB1:FK10,FK13+1)","v":{"$error":"#N/A"}},{"$f":"VLOOKUP((ROUNDUP(FL15*0.8, 0)),$FB1:FL10,FL13+1)","v":{"$error":"#N/A"}},{"$f":"VLOOKUP((ROUNDUP(FM15*0.8, 0)),$FB1:FM10,FM13+1)","v":{"$error":"#N/A"}},{"$f":"VLOOKUP((ROUNDUP(FN15*0.8, 0)),$FB1:FN10,FN13+1)","v":{"$error":"#N/A"}},{"$f":"VLOOKUP((ROUNDUP(FO15*0.8, 0)),$FB1:FO10,FO13+1)","v":{"$error":"#N/A"}},{"$f":"VLOOKUP((ROUNDUP(FP15*0.8, 0)),$FB1:FP10,FP13+1)","v":{"$error":"#N/A"}},{"$f":"VLOOKUP((ROUNDUP(FQ15*0.8, 0)),$FB1:FQ10,FQ13+1)","v":{"$error":"#N/A"}},{"$f":"VLOOKUP((ROUNDUP(FR15*0.8, 0)),$FB1:FR10,FR13+1)","v":{"$error":"#N/A"}},{"$f":"VLOOKUP((ROUNDUP(FS15*0.8, 0)),$FB1:FS10,FS13+1)","v":{"$error":"#N/A"}},{"$f":"VLOOKUP((ROUNDUP(FT15*0.8, 0)),$FB1:FT10,FT13+1)","v":{"$error":"#N/A"}},{"$f":"VLOOKUP((ROUNDUP(FU15*0.8, 0)),$FB1:FU10,FU13+1)","v":{"$error":"#N/A"}},{"$f":"VLOOKUP((ROUNDUP(FV15*0.8, 0)),$FB1:FV10,FV13+1)","v":{"$error":"#N/A"}},{"$f":"VLOOKUP((ROUNDUP(FW15*0.8, 0)),$FB1:FW10,FW13+1)","v":{"$error":"#N/A"}},{"$f":"VLOOKUP((ROUNDUP(FX15*0.8, 0)),$FB1:FX10,FX13+1)","v":{"$error":"#N/A"}},{"$f":"VLOOKUP((ROUNDUP(FY15*0.8, 0)),$FB1:FY10,FY13+1)","v":{"$error":"#N/A"}},{"$f":"VLOOKUP((ROUNDUP(FZ15*0.8, 0)),$FB1:FZ10,FZ13+1)","v":{"$error":"#N/A"}},{"$f":"VLOOKUP((ROUNDUP(GA15*0.8, 0)),$FB1:GA10,GA13+1)","v":{"$error":"#N/A"}},{"$f":"VLOOKUP((ROUNDUP(GB15*0.8, 0)),$FB1:GB10,GB13+1)","v":{"$error":"#N/A"}},{"$f":"VLOOKUP((ROUNDUP(GC15*0.8, 0)),$FB1:GC10,GC13+1)","v":{"$error":"#N/A"}},{"$f":"VLOOKUP((ROUNDUP(GD15*0.8, 0)),$FB1:GD10,GD13+1)","v":{"$error":"#N/A"}},{"$f":"VLOOKUP((ROUNDUP(GE15*0.8, 0)),$FB1:GE10,GE13+1)","v":{"$error":"#N/A"}},{"$f":"VLOOKUP((ROUNDUP(GF15*0.8, 0)),$FB1:GF10,GF13+1)","v":{"$error":"#N/A"}},{"$f":"VLOOKUP((ROUNDUP(GG15*0.8, 0)),$FB1:GG10,GG13+1)","v":{"$error":"#N/A"}},{"$f":"VLOOKUP((ROUNDUP(GH15*0.8, 0)),$FB1:GH10,GH13+1)","v":{"$error":"#N/A"}},{"$f":"VLOOKUP((ROUNDUP(GI15*0.8, 0)),$FB1:GI10,GI13+1)","v":{"$error":"#N/A"}},{"$f":"VLOOKUP((ROUNDUP(GJ15*0.8, 0)),$FB1:GJ10,GJ13+1)","v":{"$error":"#N/A"}},{"$f":"VLOOKUP((ROUNDUP(GK15*0.8, 0)),$FB1:GK10,GK13+1)","v":{"$error":"#N/A"}},{"$f":"VLOOKUP((ROUNDUP(GL15*0.8, 0)),$FB1:GL10,GL13+1)","v":{"$error":"#N/A"}},{"$f":"VLOOKUP((ROUNDUP(GM15*0.8, 0)),$FB1:GM10,GM13+1)","v":{"$error":"#N/A"}},{"$f":"VLOOKUP((ROUNDUP(GN15*0.8, 0)),$FB1:GN10,GN13+1)","v":{"$error":"#N/A"}},{"$f":"VLOOKUP((ROUNDUP(GO15*0.8, 0)),$FB1:GO10,GO13+1)","v":{"$error":"#N/A"}},{"$f":"VLOOKUP((ROUNDUP(GP15*0.8, 0)),$FB1:GP10,GP13+1)","v":{"$error":"#N/A"}},{"$f":"VLOOKUP((ROUNDUP(GQ15*0.8, 0)),$FB1:GQ10,GQ13+1)","v":{"$error":"#N/A"}},{"$f":"VLOOKUP((ROUNDUP(GR15*0.8, 0)),$FB1:GR10,GR13+1)","v":{"$error":"#N/A"}},{"$f":"VLOOKUP((ROUNDUP(GS15*0.8, 0)),$FB1:GS10,GS13+1)","v":{"$error":"#N/A"}},{"$f":"VLOOKUP((ROUNDUP(GT15*0.8, 0)),$FB1:GT10,GT13+1)","v":{"$error":"#N/A"}},{"$f":"VLOOKUP((ROUNDUP(GU15*0.8, 0)),$FB1:GU10,GU13+1)","v":{"$error":"#N/A"}},{"$f":"VLOOKUP((ROUNDUP(GV15*0.8, 0)),$FB1:GV10,GV13+1)","v":{"$error":"#N/A"}},{"$f":"VLOOKUP((ROUNDUP(GW15*0.8, 0)),$FB1:GW10,GW13+1)","v":{"$error":"#N/A"}},{"$f":"VLOOKUP((ROUNDUP(GX15*0.8, 0)),$FB1:GX10,GX13+1)","v":{"$error":"#N/A"}},{"$f":"VLOOKUP((ROUNDUP(GY15*0.8, 0)),$FB1:GY10,GY13+1)","v":{"$error":"#N/A"}},{"$f":"VLOOKUP((ROUNDUP(GZ15*0.8, 0)),$FB1:GZ10,GZ13+1)","v":{"$error":"#N/A"}}]
[null,null,null,null,null,null,null,null,null,null,null,null,null,null,null,null,null,null,null,null,null,null,null,null,null,null,null,null,null,null,null,null,null,null,null,null,null,null,null,null,null,null,null,null,null,null,null,null,null,null,null,null,null,null,null,null,null,null,null,null,null,null,null,null,null,null,null,null,null,null,null,null,null,null,null,null,null,null,null,null,null,null,null,null,null,null,null,null,null,null,null,null,null,null,null,null,null,null,null,null,null,null,null,null,null,null,null,null,null,null,null,null,null,null,null,null,null,null,null,null,null,null,null,null,null,null,null,null,null,null,null,null,null,null,null,null,null,null,null,null,null,null,null,null,null,null,null,null,null,null,null,null,null,null,null,null,null,"80P.OG",{"$f":"VLOOKUP((ROUNDDOWN(FC15*0.8+1, 0)),$FB1:FC10,FC13+1)","v":3.4},{"$f":"VLOOKUP((ROUNDDOWN(FD15*0.8+1, 0)),$FB1:FD10,FD13+1)","v":""},{"$f":"VLOOKUP((ROUNDDOWN(FE15*0.8+1, 0)),$FB1:FE10,FE13+1)","v":""},{"$f":"VLOOKUP((ROUNDDOWN(FF15*0.8+1, 0)),$FB1:FF10,FF13+1)","v":""},{"$f":"VLOOKUP((ROUNDDOWN(FG15*0.8+1, 0)),$FB1:FG10,FG13+1)","v":""},{"$f":"VLOOKUP((ROUNDDOWN(FH15*0.8+1, 0)),$FB1:FH10,FH13+1)","v":""},{"$f":"VLOOKUP((ROUNDDOWN(FI15*0.8+1, 0)),$FB1:FI10,FI13+1)","v":""},{"$f":"VLOOKUP((ROUNDDOWN(FJ15*0.8+1, 0)),$FB1:FJ10,FJ13+1)","v":""},{"$f":"VLOOKUP((ROUNDDOWN(FK15*0.8+1, 0)),$FB1:FK10,FK13+1)","v":""},{"$f":"VLOOKUP((ROUNDDOWN(FL15*0.8+1, 0)),$FB1:FL10,FL13+1)","v":""},{"$f":"VLOOKUP((ROUNDDOWN(FM15*0.8+1, 0)),$FB1:FM10,FM13+1)","v":""},{"$f":"VLOOKUP((ROUNDDOWN(FN15*0.8+1, 0)),$FB1:FN10,FN13+1)","v":""},{"$f":"VLOOKUP((ROUNDDOWN(FO15*0.8+1, 0)),$FB1:FO10,FO13+1)","v":""},{"$f":"VLOOKUP((ROUNDDOWN(FP15*0.8+1, 0)),$FB1:FP10,FP13+1)","v":""},{"$f":"VLOOKUP((ROUNDDOWN(FQ15*0.8+1, 0)),$FB1:FQ10,FQ13+1)","v":""},{"$f":"VLOOKUP((ROUNDDOWN(FR15*0.8+1, 0)),$FB1:FR10,FR13+1)","v":""},{"$f":"VLOOKUP((ROUNDDOWN(FS15*0.8+1, 0)),$FB1:FS10,FS13+1)","v":""},{"$f":"VLOOKUP((ROUNDDOWN(FT15*0.8+1, 0)),$FB1:FT10,FT13+1)","v":""},{"$f":"VLOOKUP((ROUNDDOWN(FU15*0.8+1, 0)),$FB1:FU10,FU13+1)","v":""},{"$f":"VLOOKUP((ROUNDDOWN(FV15*0.8+1, 0)),$FB1:FV10,FV13+1)","v":""},{"$f":"VLOOKUP((ROUNDDOWN(FW15*0.8+1, 0)),$FB1:FW10,FW13+1)","v":""},{"$f":"VLOOKUP((ROUNDDOWN(FX15*0.8+1, 0)),$FB1:FX10,FX13+1)","v":""},{"$f":"VLOOKUP((ROUNDDOWN(FY15*0.8+1, 0)),$FB1:FY10,FY13+1)","v":""},{"$f":"VLOOKUP((ROUNDDOWN(FZ15*0.8+1, 0)),$FB1:FZ10,FZ13+1)","v":""},{"$f":"VLOOKUP((ROUNDDOWN(GA15*0.8+1, 0)),$FB1:GA10,GA13+1)","v":""},{"$f":"VLOOKUP((ROUNDDOWN(GB15*0.8+1, 0)),$FB1:GB10,GB13+1)","v":""},{"$f":"VLOOKUP((ROUNDDOWN(GC15*0.8+1, 0)),$FB1:GC10,GC13+1)","v":""},{"$f":"VLOOKUP((ROUNDDOWN(GD15*0.8+1, 0)),$FB1:GD10,GD13+1)","v":""},{"$f":"VLOOKUP((ROUNDDOWN(GE15*0.8+1, 0)),$FB1:GE10,GE13+1)","v":""},{"$f":"VLOOKUP((ROUNDDOWN(GF15*0.8+1, 0)),$FB1:GF10,GF13+1)","v":""},{"$f":"VLOOKUP((ROUNDDOWN(GG15*0.8+1, 0)),$FB1:GG10,GG13+1)","v":""},{"$f":"VLOOKUP((ROUNDDOWN(GH15*0.8+1, 0)),$FB1:GH10,GH13+1)","v":""},{"$f":"VLOOKUP((ROUNDDOWN(GI15*0.8+1, 0)),$FB1:GI10,GI13+1)","v":""},{"$f":"VLOOKUP((ROUNDDOWN(GJ15*0.8+1, 0)),$FB1:GJ10,GJ13+1)","v":""},{"$f":"VLOOKUP((ROUNDDOWN(GK15*0.8+1, 0)),$FB1:GK10,GK13+1)","v":""},{"$f":"VLOOKUP((ROUNDDOWN(GL15*0.8+1, 0)),$FB1:GL10,GL13+1)","v":""},{"$f":"VLOOKUP((ROUNDDOWN(GM15*0.8+1, 0)),$FB1:GM10,GM13+1)","v":""},{"$f":"VLOOKUP((ROUNDDOWN(GN15*0.8+1, 0)),$FB1:GN10,GN13+1)","v":""},{"$f":"VLOOKUP((ROUNDDOWN(GO15*0.8+1, 0)),$FB1:GO10,GO13+1)","v":""},{"$f":"VLOOKUP((ROUNDDOWN(GP15*0.8+1, 0)),$FB1:GP10,GP13+1)","v":""},{"$f":"VLOOKUP((ROUNDDOWN(GQ15*0.8+1, 0)),$FB1:GQ10,GQ13+1)","v":""},{"$f":"VLOOKUP((ROUNDDOWN(GR15*0.8+1, 0)),$FB1:GR10,GR13+1)","v":""},{"$f":"VLOOKUP((ROUNDDOWN(GS15*0.8+1, 0)),$FB1:GS10,GS13+1)","v":""},{"$f":"VLOOKUP((ROUNDDOWN(GT15*0.8+1, 0)),$FB1:GT10,GT13+1)","v":""},{"$f":"VLOOKUP((ROUNDDOWN(GU15*0.8+1, 0)),$FB1:GU10,GU13+1)","v":""},{"$f":"VLOOKUP((ROUNDDOWN(GV15*0.8+1, 0)),$FB1:GV10,GV13+1)","v":""},{"$f":"VLOOKUP((ROUNDDOWN(GW15*0.8+1, 0)),$FB1:GW10,GW13+1)","v":""},{"$f":"VLOOKUP((ROUNDDOWN(GX15*0.8+1, 0)),$FB1:GX10,GX13+1)","v":""},{"$f":"VLOOKUP((ROUNDDOWN(GY15*0.8+1, 0)),$FB1:GY10,GY13+1)","v":""},{"$f":"VLOOKUP((ROUNDDOWN(GZ15*0.8+1, 0)),$FB1:GZ10,GZ13+1)","v":""}]
[]
[null,null,null,null,null,null,null,null,null,null,null,null,null,null,null,8,null,null,null,null,null,null,null,null,null,null,null,null,null,null,null,null,null,null,null,null,null,null,null,null,null,null,null,null,null,null,null,null,8,null,3,null,null,null,null,null,null,null,null,null,null,null,null,null,null,null,null,null,null,null,null,null,null,null,null,null,null,null,null,null,null,null,null,null,null,null,null,null,null,null,null,null,null,null,null,null,null,null,null,null,null,null,null,null,null,null,null,null,null,null,null,null,null,null,null,null,null,null,null,null,null,null,null,null,null,null,null,null,null,null,null,null,null,null,null,null,null,null,null,null,null,null,null,null,null,null,null,null,null,null,null,null,null,null,null,null,null,"50P",{"$f":"AVERAGE(FC17:FC18)","v":3.4},{"$f":"AVERAGE(FD17:FD18)","v":{"$error":"#N/A"}},{"$f":"AVERAGE(FE17:FE18)","v":{"$error":"#N/A"}},{"$error":"#N/A"},{"$error":"#N/A"},{"$error":"#N/A"},{"$error":"#N/A"},{"$error":"#N/A"},{"$error":"#N/A"},{"$error":"#N/A"},{"$error":"#N/A"},{"$error":"#N/A"},{"$error":"#N/A"},{"$error":"#N/A"},{"$error":"#N/A"},{"$error":"#N/A"},{"$error":"#N/A"},{"$error":"#N/A"},{"$error":"#N/A"},{"$error":"#N/A"},{"$error":"#N/A"},{"$error":"#N/A"},{"$error":"#N/A"},{"$error":"#N/A"},{"$error":"#N/A"},{"$error":"#N/A"},{"$error":"#N/A"},{"$error":"#N/A"},{"$error":"#N/A"},{"$error":"#N/A"},{"$error":"#N/A"},{"$error":"#N/A"},{"$error":"#N/A"},{"$error":"#N/A"},{"$error":"#N/A"},{"$error":"#N/A"},{"$error":"#N/A"},{"$error":"#N/A"},{"$error":"#N/A"},{"$error":"#N/A"},{"$error":"#N/A"},{"$error":"#N/A"},{"$error":"#N/A"},{"$error":"#N/A"},{"$error":"#N/A"},{"$error":"#N/A"},{"$error":"#N/A"},{"$error":"#N/A"},{"$error":"#N/A"},{"$error":"#N/A"}]
[null,null,null,null,null,null,null,null,null,null,null,null,null,null,null,null,null,null,null,null,null,null,null,null,null,null,null,null,null,null,null,null,null,null,null,null,null,null,null,null,null,null,null,null,null,null,null,null,null,null,null,null,null,null,null,null,null,null,null,null,null,null,null,null,null,null,null,null,null,null,null,null,null,null,null,null,null,null,null,null,null,null,null,null,null,null,null,null,null,null,null,null,null,null,null,null,null,null,null,null,null,null,null,null,null,null,null,null,null,null,null,null,null,null,null,null,null,null,null,null,null,null,null,null,null,null,null,null,null,null,null,null,null,null,null,null,null,null,null,null,null,null,null,null,null,null,null,null,null,null,null,null,null,null,null,null,null,"80P",{"$f":"AVERAGE(FC20:FC21)","v":3.4},{"$f":"AVERAGE(FD20:FD21)","v":{"$error":"#N/A"}},{"$f":"AVERAGE(FE20:FE21)","v":{"$error":"#N/A"}},{"$error":"#N/A"},{"$error":"#N/A"},{"$error":"#N/A"},{"$error":"#N/A"},{"$error":"#N/A"},{"$error":"#N/A"},{"$error":"#N/A"},{"$error":"#N/A"},{"$error":"#N/A"},{"$error":"#N/A"},{"$error":"#N/A"},{"$error":"#N/A"},{"$error":"#N/A"},{"$error":"#N/A"},{"$error":"#N/A"},{"$error":"#N/A"},{"$error":"#N/A"},{"$error":"#N/A"},{"$error":"#N/A"},{"$error":"#N/A"},{"$error":"#N/A"},{"$error":"#N/A"},{"$error":"#N/A"},{"$error":"#N/A"},{"$error":"#N/A"},{"$error":"#N/A"},{"$error":"#N/A"},{"$error":"#N/A"},{"$error":"#N/A"},{"$error":"#N/A"},{"$error":"#N/A"},{"$error":"#N/A"},{"$error":"#N/A"},{"$error":"#N/A"},{"$error":"#N/A"},{"$error":"#N/A"},{"$error":"#N/A"},{"$error":"#N/A"},{"$error":"#N/A"},{"$error":"#N/A"},{"$error":"#N/A"},{"$error":"#N/A"},{"$error":"#N/A"},{"$error":"#N/A"},{"$error":"#N/A"},{"$error":"#N/A"},{"$error":"#N/A"}]
[]
[null,null,null,null,null,null,null,null,null,null,null,null,null,null,null,null,null,null,null,null,null,null,null,null,null,null,null,null,null,null,null,null,null,null,null,null,null,null,null,null,null,null,null,null,null,null,null,null,null,null,null,null,null,null,null,null,null,null,null,null,null,null,null,null,null,null,null,null,null,null,null,null,null,null,null,null,null,null,null,null,null,null,null,null,null,null,null,null,null,null,null,null,null,null,null,null,null,null,null,null,null,null,null,null,null,null,null,null,null,null,null,null,null,null,null,null,null,null,null,null,null,null,null,null,null,null,null,null,null,null,null,null,null,null,null,null,null,null,null,null,null,null,null,null,null,null,null,null,null,null,null,null,null,null,null,null,null,"VF80:50",{"$f":"FC24/FC23","v":1},{"$f":"FD24/FD23","v":{"$error":"#N/A"}},{"$error":"#N/A"},{"$error":"#N/A"},{"$error":"#N/A"},{"$error":"#N/A"},{"$error":"#N/A"},{"$f":"FJ24/FJ23","v":{"$error":"#N/A"}},{"$error":"#N/A"},{"$error":"#N/A"},{"$error":"#N/A"},{"$error":"#N/A"},{"$error":"#N/A"},{"$error":"#N/A"},{"$error":"#N/A"},{"$error":"#N/A"},{"$error":"#N/A"},{"$error":"#N/A"},{"$error":"#N/A"},{"$error":"#N/A"},{"$error":"#N/A"},{"$error":"#N/A"},{"$error":"#N/A"},{"$error":"#N/A"},{"$error":"#N/A"},{"$error":"#N/A"},{"$error":"#N/A"},{"$error":"#N/A"},{"$error":"#N/A"},{"$error":"#N/A"},{"$error":"#N/A"},{"$error":"#N/A"},{"$error":"#N/A"},{"$error":"#N/A"},{"$error":"#N/A"},{"$error":"#N/A"},{"$error":"#N/A"},{"$error":"#N/A"},{"$error":"#N/A"},{"$error":"#N/A"},{"$error":"#N/A"},{"$error":"#N/A"},{"$error":"#N/A"},{"$error":"#N/A"},{"$error":"#N/A"},{"$error":"#N/A"},{"$error":"#N/A"},{"$error":"#N/A"},{"$error":"#N/A"},{"$error":"#N/A"}]
[]
[null,null,null,null,null,null,null,null,null,null,null,null,null,null,null,null,null,null,null,null,null,null,null,null,null,null,null,null,null,null,null,null,null,null,null,null,null,null,null,null,null,null,null,null,null,null,null,null,null,null,null,null,null,null,null,null,null,null,null,null,null,null,null,null,null,null,null,null,null,null,null,null,null,null,null,null,null,null,null,null,null,null,null,null,null,null,null,null,null,null,null,null,null,null,null,null,null,null,null,null,null,null,null,null,null,null,null,null,null,null,null,null,null,null,null,null,null,null,null,null,null,null,null,null,null,null,null,null,null,null,null,null,null,null,null,null,null,null,null,null,null,null,null,null,null,null,null,null,null,null,null,null,null,null,null,null,null,"Ausgabe"]
[null,null,null,null,null,null,null,null,null,null,null,null,null,null,null,null,null,null,null,null,null,null,null,null,null,null,null,null,null,null,null,null,null,null,null,null,null,null,null,null,null,null,null,null,null,null,null,null,null,null,null,null,null,null,null,null,null,null,null,null,null,null,null,null,null,null,null,null,null,null,null,null,null,null,null,null,null,null,null,null,null,null,null,null,null,null,null,null,null,null,null,null,null,null,null,null,null,null,null,null,null,null,null,null,null,null,null,null,null,null,null,null,null,null,null,null,null,null,null,null,null,null,null,null,null,null,null,null,null,null,null,null,null,null,null,null,null,null,null,null,null,null,null,null,null,null,null,null,null,null,null,null,null,null,null,null,null,"Anz.Dezimalstellen",{"$f":"IF(FC23<1,3,2)","v":2},{"$f":"IF(FD23<1,3,2)","v":{"$error":"#N/A"}},{"$error":"#N/A"},{"$error":"#N/A"},{"$error":"#N/A"},{"$error":"#N/A"},{"$error":"#N/A"},{"$error":"#N/A"},{"$error":"#N/A"},{"$error":"#N/A"},{"$error":"#N/A"},{"$error":"#N/A"},{"$error":"#N/A"},{"$error":"#N/A"},{"$error":"#N/A"},{"$error":"#N/A"},{"$error":"#N/A"},{"$error":"#N/A"},{"$error":"#N/A"},{"$error":"#N/A"},{"$error":"#N/A"},{"$error":"#N/A"},{"$error":"#N/A"},{"$error":"#N/A"},{"$error":"#N/A"},{"$error":"#N/A"},{"$error":"#N/A"},{"$error":"#N/A"},{"$error":"#N/A"},{"$error":"#N/A"},{"$error":"#N/A"},{"$error":"#N/A"},{"$error":"#N/A"},{"$error":"#N/A"},{"$error":"#N/A"},{"$error":"#N/A"},{"$error":"#N/A"},{"$error":"#N/A"},{"$error":"#N/A"},{"$error":"#N/A"},{"$error":"#N/A"},{"$error":"#N/A"},{"$error":"#N/A"},{"$error":"#N/A"},{"$error":"#N/A"},{"$error":"#N/A"},{"$error":"#N/A"},{"$error":"#N/A"},{"$error":"#N/A"},{"$error":"#N/A"}]
[null,null,null,null,null,null,null,null,null,null,null,null,null,null,null,null,null,null,null,null,null,null,null,null,null,null,null,null,null,null,null,null,null,null,null,null,null,null,null,null,null,null,null,null,null,null,null,null,null,null,null,null,null,null,null,null,null,null,null,null,null,null,null,null,null,null,null,null,null,null,null,null,null,null,null,null,null,null,null,null,null,null,null,null,null,null,null,null,null,null,null,null,null,null,null,null,null,null,null,null,null,null,null,null,null,null,null,null,null,null,null,null,null,null,null,null,null,null,null,null,null,null,null,null,null,null,null,null,null,null,null,null,null,null,null,null,null,null,null,null,null,null,null,null,null,null,null,null,null,null,null,null,null,null,null,null,null,"Anzahl",{"$f":"IF(FC15=0,\"\",FC15)","v":1},{"$f":"IF(FD15=0,\"\",FD15)","v":""},"","","","","","","","","","","","","","","","","","","","","","","","","","","","","","","","","","","","","","","","","","","","","","","",""]
[null,null,null,null,null,null,null,null,null,null,null,null,null,null,null,null,null,null,null,null,null,null,null,null,null,null,null,null,null,null,null,null,null,null,null,null,null,null,null,null,null,null,null,null,null,null,null,null,null,null,null,null,null,null,null,null,null,null,null,null,null,null,null,null,null,null,null,null,null,null,null,null,null,null,null,null,null,null,null,null,null,null,null,null,null,null,null,null,null,null,null,null,null,null,null,null,null,null,null,null,null,null,null,null,null,null,null,null,null,null,null,null,null,null,null,null,null,null,null,null,null,null,null,null,null,null,null,null,null,null,null,null,null,null,null,null,null,null,null,null,null,null,null,null,null,null,null,null,null,null,null,null,null,null,null,null,null,"Median",{"$f":"IF(FC15=0,\"\",IF(AND(FC15>0,FC15<5),\"zu wenige\",ROUND(FC23, FC29)))","v":"zu wenige"},"","","","","","","","","","","","","","","","","","","","","","","","","","","","","","","",{"$f":"IF(GI15=0,\"\",IF(AND(GI15>0,GI15<5),\"zu wenige\",ROUND(GI23, GI29)))","v":""},"","","","","","","","","","","","","","","","",""]
[null,null,null,null,null,null,null,null,null,null,null,null,null,null,null,null,null,null,null,null,null,null,null,null,null,null,null,null,null,null,null,null,null,null,null,null,null,null,null,null,null,null,null,null,null,null,null,null,null,null,null,null,null,null,null,null,null,null,null,null,null,null,null,null,null,null,null,null,null,null,null,null,null,null,null,null,null,null,null,null,null,null,null,null,null,null,null,null,null,null,null,null,null,null,null,null,null,null,null,null,null,null,null,null,null,null,null,null,null,null,null,null,null,null,null,null,null,null,null,null,null,null,null,null,null,null,null,null,null,null,null,null,null,null,null,null,null,null,null,null,null,null,null,null,null,null,null,null,null,null,null,null,null,null,null,null,null,"80-er Perzentil",{"$f":"IF(FC15=0,\"\",IF(AND(FC15>0,FC15<5),\"Messwerte\",ROUND(FC24, FC29)))","v":"Messwerte"},"","","","","","","","","","","","","","","","","","","","","","","","","","","","","","","",{"$f":"IF(GI15=0,\"\",IF(AND(GI15>0,GI15<5),\"Messwerte\",ROUND(GI24, GI29)))","v":""},"","","","","","","","","","","","","","","","",""]
[null,null,null,null,null,null,null,null,null,null,null,null,null,null,null,null,null,null,null,null,null,null,null,null,null,null,null,null,null,null,null,null,null,null,null,null,null,null,null,null,null,null,null,null,null,null,null,null,null,null,null,null,null,null,null,null,null,null,null,null,null,null,null,null,null,null,null,null,null,null,null,null,null,null,null,null,null,null,null,null,null,null,null,null,null,null,null,null,null,null,null,null,null,null,null,null,null,null,null,null,null,null,null,null,null,null,null,null,null,null,null,null,null,null,null,null,null,null,null,null,null,null,null,null,null,null,null,null,null,null,null,null,null,null,null,null,null,null,null,null,null,null,null,null,null,null,null,null,null,null,null,null,null,null,null,null,null,"Verhältnisfaktor\n 80 P : 50 P",{"$f":"IF(AND(FC15>4,ISNUMBER(FC26)),ROUND(FC26, 1),\"\")","v":""},{"$f":"IF(AND(FD15>4,ISNUMBER(FD26)),ROUND(FD26, 1),\"\")","v":""},"","","","","",{"$f":"IF(AND(FJ15>4,ISNUMBER(FJ26)),ROUND(FJ26, 1),\"\")","v":""},"","","","","","","","","","","","","","","","","","","","","","","","","","","","","","","","","","","","","","","","","",""]

{"sheet":"AUTO","index":11,"n_rows":4,"n_cols":2,"rows_kept":4,"cut":false,"hidden":true,"merged":[]}
[4,"<3,4"]
[3,3.4]
[2,3.4]
[1,3.4]